{"text_format":"1","workbook":"xlsx","n_sheets":4,"sheets":["Title","Sheet4","Data","Wrap Up"],"not_rendered":{"charts":0,"images":6,"macros":0,"external_links":0,"defined_names":0,"comments":0,"pivot_tables":1},"unopened":[],"bounds":{"document_bytes":16777216,"sheet_cells":100000,"rows_first":2000,"rows_last":500,"rows_between":2000,"halvings":0,"cell_chars":16384,"cell_head_chars":4096},"cells_cut":0,"cells_raw":0,"read":"whole","date_system":"1900"}

{"sheet":"Title","index":0,"n_rows":25,"n_cols":13,"rows_kept":25,"cut":false,"hidden":false,"merged":[]}
[]
[]
[]
[]
[]
[]
[null,null,null,null,null,null,null,null,null,null,null,null,2102]
[]
[]
[]
[]
[]
[]
[]
[]
[]
[]
[]
[]
[]
[]
[]
[]
[]
["Image credit: Photoshot / Pixabay"]

{"sheet":"Sheet4","index":1,"n_rows":8,"n_cols":4,"rows_kept":8,"cut":false,"hidden":false,"merged":[]}
[]
[]
["Size","Count of Customer","Sum of Profit","Accum % of Profit"]
["A - Less than $10K",458,1130218,7.1709576146813087E-2]
["B - $10K to $20K",530,3506530,0.2941903542321776]
["C - $20K to $30K",138,1320040,0.37794367341205187]
["E - Over $1MM",24,9804259,1]
["Grand Total",1150,15761047]

{"sheet":"Data","index":2,"n_rows":1151,"n_cols":14,"rows_kept":1151,"cut":false,"hidden":false,"merged":[]}
["Product","Date","Weekday","Customer","Sector","Quantity","Revenue","Profit","Cost","Size",null,null,"Amount"]
["Widget","2019-03-13","Wed","Steve Comer","Services",100,1699,847,857,{"$f":"VLOOKUP(G2,$M$2:$N$6,2,TRUE)","v":"A - Less than $10K"},null,null,0,"A - Less than $10K"]
["Widget","2019-03-13","Wed","Steve Comer","Services",100,1704,847,857,{"$f":"VLOOKUP(G3,$M$2:$N$6,2,TRUE)","v":"A - Less than $10K"},null,null,10000,"B - $10K to $20K"]
["Widget","2019-01-14","Mon","Profology.com","Consulting",100,1735,847,893,"A - Less than $10K",null,null,20000,"C - $20K to $30K"]
["Gadget","2019-09-17","Tue","St. Peter's Prep","Training",100,1736,847,894,"A - Less than $10K",null,null,30000,"D - $30K to $1MM"]
["Widget","2019-01-14","Mon","Profology.com","Consulting",100,1740,847,893,"A - Less than $10K",null,null,1000000,"E - Over $1MM"]
["Gadget","2019-09-17","Tue","St. Peter's Prep","Training",100,1741,847,894,"A - Less than $10K"]
["Widget","2019-09-19","Thu","Profology.com","Consulting",100,1790,847,948,"A - Less than $10K"]
["Widget","2019-09-19","Thu","Profology.com","Consulting",100,1795,847,948,"A - Less than $10K"]
["Widget","2018-02-08","Thu","Surten Excel","Consulting",100,1812,847,970,"A - Less than $10K"]
["Widget","2018-03-13","Tue","Orange County Health Department","Associations",100,1814,847,972,"A - Less than $10K"]
["Widget","2018-08-27","Mon","SpringBoard","Utilities",100,1814,847,972,"A - Less than $10K"]
["Widget","2018-02-08","Thu","Surten Excel","Consulting",100,1817,847,970,"A - Less than $10K"]
["Widget","2018-03-13","Tue","Orange County Health Department","Associations",100,1819,847,972,"A - Less than $10K"]
["Widget","2018-08-27","Mon","SpringBoard","Utilities",100,1819,847,972,"A - Less than $10K"]
["Widget","2018-08-20","Mon","Safety Elements Ltd.","Services",100,1831,847,989,"A - Less than $10K"]
["Widget","2018-08-20","Mon","Safety Elements Ltd.","Services",100,1836,847,989,"A - Less than $10K"]
["Widget","2019-05-07","Tue","SkyWire, Inc.","Utilities",100,1837,847,995,"A - Less than $10K"]
["Widget","2019-05-07","Tue","SkyWire, Inc.","Utilities",100,1842,847,995,"A - Less than $10K"]
["Gadget","2018-12-27","Thu","Reports Wand","Applications",100,1856,847,1014,"A - Less than $10K"]
["Gadget","2018-12-27","Thu","Reports Wand","Applications",100,1861,847,1014,"A - Less than $10K"]
["Widget","2018-10-03","Wed","Safety Elements Ltd.","Services",100,1872,847,1030,"A - Less than $10K"]
["Widget","2018-12-10","Mon","Ribbon Commander Framework","Utilities",100,1873,847,1031,"A - Less than $10K"]
["Widget","2018-10-03","Wed","Safety Elements Ltd.","Services",100,1877,847,1030,"A - Less than $10K"]
["Widget","2018-06-24","Sun","St. Peter's Prep","Training",100,1877,847,1035,"A - Less than $10K"]
["Widget","2018-12-10","Mon","Ribbon Commander Framework","Utilities",100,1878,847,1031,"A - Less than $10K"]
["Widget","2018-06-24","Sun","St. Peter's Prep","Training",100,1882,847,1035,"A - Less than $10K"]
["Widget","2018-08-25","Sat","Tennessee Moon","Retail",100,1908,847,1066,"A - Less than $10K"]
["Widget","2018-08-25","Sat","Tennessee Moon","Retail",100,1913,847,1066,"A - Less than $10K"]
["Widget","2018-09-06","Thu","Resource Optimizer","Utilities",100,1952,847,1110,"A - Less than $10K"]
["Widget","2018-09-06","Thu","Resource Optimizer","Utilities",100,1957,847,1110,"A - Less than $10K"]
["Widget","2019-12-24","Tue","SkyWire, Inc.","Utilities",100,1963,847,1121,"A - Less than $10K"]
["Widget","2019-12-24","Tue","SkyWire, Inc.","Utilities",100,1968,847,1121,"A - Less than $10K"]
["Widget","2019-05-08","Wed","Serving Brevard Realty","Services",100,1977,847,1135,"A - Less than $10K"]
["Widget","2019-05-08","Wed","Serving Brevard Realty","Services",100,1982,847,1135,"A - Less than $10K"]
["Gadget","2018-11-28","Wed","St. Peter's Prep","Training",100,1999,984,1020,"A - Less than $10K"]
["Gadget","2018-11-28","Wed","St. Peter's Prep","Training",100,2004,984,1020,"A - Less than $10K"]
["Widget","2018-09-01","Sat","Steve Comer","Services",100,2007,847,1165,"A - Less than $10K"]
["Widget","2018-09-01","Sat","Steve Comer","Services",100,2012,847,1165,"A - Less than $10K"]
["Widget","2019-08-28","Wed","SlinkyRN Excel Instruction and Consulting","Consulting",100,2023,847,1181,"A - Less than $10K"]
["Gadget","2019-09-09","Mon","Profology.com","Consulting",100,2024,984,1045,"A - Less than $10K"]
["Widget","2019-08-28","Wed","SlinkyRN Excel Instruction and Consulting","Consulting",100,2028,847,1181,"A - Less than $10K"]
["Gadget","2019-09-09","Mon","Profology.com","Consulting",100,2029,984,1045,"A - Less than $10K"]
["Gadget","2018-01-19","Fri","SlinkyRN Excel Instruction and Consulting","Consulting",100,2037,984,1058,"A - Less than $10K"]
["Gadget","2018-01-19","Fri","SlinkyRN Excel Instruction and Consulting","Consulting",100,2042,984,1058,"A - Less than $10K"]
["Gadget","2019-07-01","Mon","Orange County Health Department","Associations",100,2049,984,1070,"A - Less than $10K"]
["Widget","2018-12-25","Tue","Orange County Health Department","Associations",100,2050,847,1208,"A - Less than $10K"]
["Gizmo","2019-09-14","Sat","SlinkyRN Excel Instruction and Consulting","Consulting",100,2053,1022,1036,"A - Less than $10K"]
["Gadget","2019-07-01","Mon","Orange County Health Department","Associations",100,2054,984,1070,"A - Less than $10K"]
["Widget","2018-12-25","Tue","Orange County Health Department","Associations",100,2055,847,1208,"A - Less than $10K"]
["Gizmo","2019-09-14","Sat","SlinkyRN Excel Instruction and Consulting","Consulting",100,2058,1022,1036,"A - Less than $10K"]
["Widget","2019-02-15","Fri","Reports Wand","Applications",100,2061,847,1219,"A - Less than $10K"]
["Widget","2019-02-15","Fri","Reports Wand","Applications",100,2066,847,1219,"A - Less than $10K"]
["Gizmo","2019-10-31","Thu","Safety Elements Ltd.","Services",100,2087,1022,1070,"A - Less than $10K"]
["Gizmo","2018-09-25","Tue","SkyWire, Inc.","Utilities",100,2090,1022,1073,"A - Less than $10K"]
["Gizmo","2019-10-31","Thu","Safety Elements Ltd.","Services",100,2092,1022,1070,"A - Less than $10K"]
["Gizmo","2018-09-25","Tue","SkyWire, Inc.","Utilities",100,2095,1022,1073,"A - Less than $10K"]
["Gadget","2019-09-05","Thu","Resource Optimizer","Utilities",100,2101,984,1122,"A - Less than $10K"]
["Widget","2018-12-12","Wed","Roto-Rooter","Services",100,2103,847,1261,"A - Less than $10K"]
["Gadget","2019-09-05","Thu","Resource Optimizer","Utilities",100,2106,984,1122,"A - Less than $10K"]
["Widget","2018-12-08","Sat","SpringBoard","Utilities",100,2106,847,1264,"A - Less than $10K"]
["Widget","2018-12-12","Wed","Roto-Rooter","Services",100,2108,847,1261,"A - Less than $10K"]
["Widget","2018-12-08","Sat","SpringBoard","Utilities",100,2111,847,1264,"A - Less than $10K"]
["Gizmo","2019-05-22","Wed","Phare View Concepts","Consulting",100,2144,1022,1127,"A - Less than $10K"]
["Gizmo","2019-05-22","Wed","Phare View Concepts","Consulting",100,2149,1022,1127,"A - Less than $10K"]
["Gadget","2019-03-20","Wed","SkyWire, Inc.","Utilities",100,2152,984,1173,"A - Less than $10K"]
["Gadget","2019-03-20","Wed","SkyWire, Inc.","Utilities",100,2157,984,1173,{"$f":"VLOOKUP(G67,$M$2:$N$6,2,TRUE)","v":"A - Less than $10K"}]
["Gizmo","2019-04-05","Fri","Steve Comer","Services",100,2173,1022,1156,"A - Less than $10K"]
["Gizmo","2019-04-05","Fri","Steve Comer","Services",100,2178,1022,1156,"A - Less than $10K"]
["Gizmo","2018-12-21","Fri","Serving Brevard Realty","Services",100,2208,1022,1191,"A - Less than $10K"]
["Gizmo","2018-12-21","Fri","Serving Brevard Realty","Services",100,2213,1022,1191,"A - Less than $10K"]
["Gadget","2018-06-25","Mon","Serving Brevard Realty","Services",100,2216,984,1237,"A - Less than $10K"]
["Gadget","2018-06-25","Mon","Serving Brevard Realty","Services",100,2221,984,1237,"A - Less than $10K"]
["Gadget","2018-06-30","Sat","Serving Brevard Realty","Services",100,2226,984,1247,"A - Less than $10K"]
["Gizmo","2019-10-29","Tue","Safety Elements Ltd.","Services",100,2229,1022,1212,"A - Less than $10K"]
["Gadget","2018-06-30","Sat","Serving Brevard Realty","Services",100,2231,984,1247,"A - Less than $10K"]
["Gizmo","2019-10-29","Tue","Safety Elements Ltd.","Services",100,2234,1022,1212,"A - Less than $10K"]
["Gadget","2018-01-02","Tue","Phare View Concepts","Consulting",100,2252,984,1273,"A - Less than $10K"]
["Gadget","2018-01-02","Tue","Phare View Concepts","Consulting",100,2257,984,1273,"A - Less than $10K"]
["Gadget","2019-03-19","Tue","Roto-Rooter","Services",100,2267,984,1288,"A - Less than $10K"]
["Gadget","2019-03-19","Tue","Roto-Rooter","Services",100,2272,984,1288,"A - Less than $10K"]
["Gizmo","2019-12-08","Sun","SkyWire, Inc.","Utilities",100,2304,1022,1287,"A - Less than $10K"]
["Gizmo","2019-12-08","Sun","SkyWire, Inc.","Utilities",100,2309,1022,1287,"A - Less than $10K"]
["Gadget","2018-05-24","Thu","Safety Elements Ltd.","Services",100,2314,984,1335,"A - Less than $10K"]
["Gizmo","2018-08-07","Tue","Ribbon Commander Framework","Utilities",100,2315,1022,1298,"A - Less than $10K"]
["Gadget","2018-05-24","Thu","Safety Elements Ltd.","Services",100,2319,984,1335,"A - Less than $10K"]
["Gizmo","2018-08-07","Tue","Ribbon Commander Framework","Utilities",100,2320,1022,1298,"A - Less than $10K"]
["Gizmo","2018-11-01","Thu","Resource Optimizer","Utilities",100,2338,1022,1321,"A - Less than $10K"]
["Gizmo","2018-11-01","Thu","Resource Optimizer","Utilities",100,2343,1022,1321,"A - Less than $10K"]
["Gadget","2018-10-08","Mon","Resource Optimizer","Utilities",100,2353,984,1374,"A - Less than $10K"]
["Gadget","2018-10-08","Mon","Resource Optimizer","Utilities",100,2358,984,1374,"A - Less than $10K"]
["Gizmo","2018-01-14","Sun","Safety Elements Ltd.","Services",100,2396,1022,1379,"A - Less than $10K"]
["Gizmo","2018-01-14","Sun","Safety Elements Ltd.","Services",100,2401,1022,1379,"A - Less than $10K"]
["Gadget","2019-08-24","Sat","Tennessee Moon","Retail",100,2404,984,1425,"A - Less than $10K"]
["Gadget","2018-11-23","Fri","Reports Wand","Applications",100,2405,984,1426,"A - Less than $10K"]
["Gadget","2019-08-24","Sat","Tennessee Moon","Retail",100,2409,984,1425,"A - Less than $10K"]
["Gadget","2018-11-23","Fri","Reports Wand","Applications",100,2410,984,1426,"A - Less than $10K"]
["Gadget","2018-04-23","Mon","St. Peter's Prep","Training",100,2452,984,1473,"A - Less than $10K"]
["Gadget","2018-04-23","Mon","St. Peter's Prep","Training",100,2457,984,1473,"A - Less than $10K"]
["Gizmo","2018-04-05","Thu","Phare View Concepts","Consulting",100,2461,1022,1444,"A - Less than $10K"]
["Gizmo","2018-04-05","Thu","Phare View Concepts","Consulting",100,2466,1022,1444,"A - Less than $10K"]
["Doodads","2019-03-24","Sun","Orange County Health Department","Associations",100,2479,1022,1462,"A - Less than $10K"]
["Gizmo","2019-05-23","Thu","Safety Elements Ltd.","Services",100,2482,1022,1465,"A - Less than $10K"]
["Doodads","2019-03-24","Sun","Orange County Health Department","Associations",100,2484,1022,1462,"A - Less than $10K"]
["Gizmo","2019-05-23","Thu","Safety Elements Ltd.","Services",100,2487,1022,1465,"A - Less than $10K"]
["Gizmo","2018-10-15","Mon","Reports Wand","Applications",100,2512,1022,1495,"A - Less than $10K"]
["Gizmo","2018-10-15","Mon","Reports Wand","Applications",100,2517,1022,1495,"A - Less than $10K"]
["Gizmo","2018-11-25","Sun","Phare View Concepts","Consulting",100,2533,1022,1516,"A - Less than $10K"]
["Gizmo","2018-11-25","Sun","Phare View Concepts","Consulting",100,2538,1022,1516,"A - Less than $10K"]
["Gizmo","2019-08-04","Sun","Roto-Rooter","Services",100,2542,1022,1525,"A - Less than $10K"]
["Gizmo","2019-08-04","Sun","Roto-Rooter","Services",100,2547,1022,1525,"A - Less than $10K"]
["Widget","2019-07-22","Mon","Orange County Health Department","Associations",200,3385,1694,1696,"A - Less than $10K"]
["Widget","2019-07-22","Mon","Orange County Health Department","Associations",200,3390,1694,1696,"A - Less than $10K"]
["Widget","2019-08-05","Mon","Tennessee Moon","Retail",200,3413,1694,1724,"A - Less than $10K"]
["Widget","2019-08-05","Mon","Tennessee Moon","Retail",200,3418,1694,1724,"A - Less than $10K"]
["Doodads","2018-01-21","Sun","SpringBoard","Utilities",200,3547,1694,1858,"A - Less than $10K"]
["Doodads","2018-01-21","Sun","SpringBoard","Utilities",200,3552,1694,1858,"A - Less than $10K"]
["Widget","2019-05-28","Tue","Safety Elements Ltd.","Services",200,3627,1694,1938,"A - Less than $10K"]
["Widget","2019-05-28","Tue","Safety Elements Ltd.","Services",200,3632,1694,1938,"A - Less than $10K"]
["Gadget","2018-11-20","Tue","SpringBoard","Utilities",200,3667,1694,1978,"A - Less than $10K"]
["Gadget","2018-11-20","Tue","SpringBoard","Utilities",200,3672,1694,1978,"A - Less than $10K"]
["Widget","2018-03-24","Sat","Orange County Health Department","Associations",200,3751,1694,2062,"A - Less than $10K"]
["Widget","2018-03-24","Sat","Orange County Health Department","Associations",200,3756,1694,2062,"A - Less than $10K"]
["Widget","2018-05-01","Tue","Profology.com","Consulting",200,3797,1694,2108,"A - Less than $10K"]
["Widget","2018-05-01","Tue","Profology.com","Consulting",200,3802,1694,2108,"A - Less than $10K"]
["Widget","2018-06-15","Fri","SpringBoard","Utilities",200,3851,1694,2162,"A - Less than $10K"]
["Widget","2018-06-15","Fri","SpringBoard","Utilities",200,3856,1694,2162,"A - Less than $10K"]
["Widget","2019-02-17","Sun","Surten Excel","Consulting",200,3871,1694,2182,"A - Less than $10K"]
["Widget","2019-02-17","Sun","Surten Excel","Consulting",200,3876,1694,2182,"A - Less than $10K"]
["Gadget","2019-10-08","Tue","Safety Elements Ltd.","Services",200,3917,1694,2228,"A - Less than $10K"]
["Gadget","2019-10-08","Tue","Safety Elements Ltd.","Services",200,3922,1694,2228,{"$f":"VLOOKUP(G131,$M$2:$N$6,2,TRUE)","v":"A - Less than $10K"}]
["Gadget","2018-12-01","Sat","Roto-Rooter","Services",200,3937,1968,1974,"A - Less than $10K"]
["Gadget","2018-12-01","Sat","Roto-Rooter","Services",200,3942,1968,1974,"A - Less than $10K"]
["Widget","2019-03-06","Wed","Phare View Concepts","Consulting",200,4005,1694,2316,"A - Less than $10K"]
["Widget","2018-05-23","Wed","SlinkyRN Excel Instruction and Consulting","Consulting",200,4007,1694,2318,"A - Less than $10K"]
["Widget","2019-03-06","Wed","Phare View Concepts","Consulting",200,4010,1694,2316,"A - Less than $10K"]
["Widget","2018-05-23","Wed","SlinkyRN Excel Instruction and Consulting","Consulting",200,4012,1694,2318,"A - Less than $10K"]
["Gadget","2019-06-25","Tue","Safety Elements Ltd.","Services",200,4055,1968,2092,"A - Less than $10K"]
["Gadget","2019-06-25","Tue","Safety Elements Ltd.","Services",200,4060,1968,2092,"A - Less than $10K"]
["Gizmo","2018-04-30","Mon","Surten Excel","Consulting",200,4119,2044,2080,"A - Less than $10K"]
["Gizmo","2018-04-30","Mon","Surten Excel","Consulting",200,4124,2044,2080,"A - Less than $10K"]
["Gadget","2019-07-27","Sat","Safety Elements Ltd.","Services",200,4127,1968,2164,"A - Less than $10K"]
["Gadget","2019-07-27","Sat","Safety Elements Ltd.","Services",200,4132,1968,2164,"A - Less than $10K"]
["Widget","2018-07-18","Wed","SkyWire, Inc.","Utilities",200,4153,1694,2464,"A - Less than $10K"]
["Widget","2018-07-18","Wed","SkyWire, Inc.","Utilities",200,4158,1694,2464,"A - Less than $10K"]
["Gadget","2019-10-06","Sun","St. Peter's Prep","Training",200,4181,1968,2218,"A - Less than $10K"]
["Gadget","2019-10-06","Sun","St. Peter's Prep","Training",200,4186,1968,2218,"A - Less than $10K"]
["Widget","2019-07-03","Wed","Steve Comer","Services",200,4187,1694,2498,"A - Less than $10K"]
["Widget","2019-07-03","Wed","Steve Comer","Services",200,4192,1694,2498,"A - Less than $10K"]
["Gizmo","2018-03-05","Mon","Orange County Health Department","Associations",200,4257,2044,2218,"A - Less than $10K"]
["Gizmo","2018-06-06","Wed","Serving Brevard Realty","Services",200,4259,2044,2220,"A - Less than $10K"]
["Gizmo","2018-03-05","Mon","Orange County Health Department","Associations",200,4262,2044,2218,"A - Less than $10K"]
["Gizmo","2018-06-06","Wed","Serving Brevard Realty","Services",200,4264,2044,2220,"A - Less than $10K"]
["Gadget","2019-08-16","Fri","St. Peter's Prep","Training",200,4265,1968,2302,"A - Less than $10K"]
["Gadget","2019-08-16","Fri","St. Peter's Prep","Training",200,4270,1968,2302,"A - Less than $10K"]
["Gadget","2019-02-06","Wed","Reports Wand","Applications",200,4275,1968,2312,"A - Less than $10K"]
["Gadget","2018-06-07","Thu","Safety Elements Ltd.","Services",200,4277,1968,2314,"A - Less than $10K"]
["Gadget","2019-02-06","Wed","Reports Wand","Applications",200,4280,1968,2312,"A - Less than $10K"]
["Gadget","2018-06-10","Sun","St. Peter's Prep","Training",200,4281,1968,2318,"A - Less than $10K"]
["Gadget","2018-06-07","Thu","Safety Elements Ltd.","Services",200,4282,1968,2314,"A - Less than $10K"]
["Gadget","2018-06-10","Sun","St. Peter's Prep","Training",200,4286,1968,2318,"A - Less than $10K"]
["Gadget","2019-05-03","Fri","SpringBoard","Utilities",200,4373,1968,2410,"A - Less than $10K"]
["Gadget","2019-08-07","Wed","Roto-Rooter","Services",200,4375,1968,2412,"A - Less than $10K"]
["Gadget","2019-05-03","Fri","SpringBoard","Utilities",200,4378,1968,2410,"A - Less than $10K"]
["Gadget","2019-08-07","Wed","Roto-Rooter","Services",200,4380,1968,2412,"A - Less than $10K"]
["Gizmo","2019-05-24","Fri","Serving Brevard Realty","Services",200,4383,2044,2344,"A - Less than $10K"]
["Gizmo","2019-05-24","Fri","Serving Brevard Realty","Services",200,4388,2044,2344,"A - Less than $10K"]
["Gadget","2019-11-22","Fri","Steve Comer","Services",200,4407,1968,2444,"A - Less than $10K"]
["Gadget","2019-11-22","Fri","Steve Comer","Services",200,4412,1968,2444,"A - Less than $10K"]
["Gizmo","2018-08-28","Tue","Reports Wand","Applications",200,4435,2044,2396,"A - Less than $10K"]
["Gizmo","2018-08-28","Tue","Reports Wand","Applications",200,4440,2044,2396,"A - Less than $10K"]
["Gadget","2019-08-20","Tue","Orange County Health Department","Associations",200,4465,1968,2502,"A - Less than $10K"]
["Gadget","2019-03-25","Mon","SkyWire, Inc.","Utilities",200,4467,1968,2504,"A - Less than $10K"]
["Gadget","2019-05-23","Thu","Resource Optimizer","Utilities",200,4469,1968,2506,"A - Less than $10K"]
["Gadget","2019-08-20","Tue","Orange County Health Department","Associations",200,4470,1968,2502,"A - Less than $10K"]
["Gadget","2019-03-25","Mon","SkyWire, Inc.","Utilities",200,4472,1968,2504,"A - Less than $10K"]
["Gadget","2019-05-23","Thu","Resource Optimizer","Utilities",200,4474,1968,2506,"A - Less than $10K"]
["Gadget","2019-10-22","Tue","SkyWire, Inc.","Utilities",200,4479,1968,2516,"A - Less than $10K"]
["Gadget","2019-10-22","Tue","SkyWire, Inc.","Utilities",200,4484,1968,2516,"A - Less than $10K"]
["Gadget","2019-12-10","Tue","St. Peter's Prep","Training",200,4487,1968,2524,"A - Less than $10K"]
["Gadget","2019-12-10","Tue","St. Peter's Prep","Training",200,4492,1968,2524,"A - Less than $10K"]
["Gadget","2019-03-16","Sat","Profology.com","Consulting",200,4521,1968,2558,"A - Less than $10K"]
["Gadget","2019-03-16","Sat","Profology.com","Consulting",200,4526,1968,2558,"A - Less than $10K"]
["Gizmo","2019-08-12","Mon","Phare View Concepts","Consulting",200,4545,2044,2506,"A - Less than $10K"]
["Gizmo","2019-08-12","Mon","Phare View Concepts","Consulting",200,4550,2044,2506,"A - Less than $10K"]
["Gizmo","2019-02-27","Wed","Phare View Concepts","Consulting",200,4609,2044,2570,"A - Less than $10K"]
["Gizmo","2019-02-27","Wed","Phare View Concepts","Consulting",200,4614,2044,2570,"A - Less than $10K"]
["Gizmo","2019-12-25","Wed","Serving Brevard Realty","Services",200,4685,2044,2646,"A - Less than $10K"]
["Gizmo","2019-12-25","Wed","Serving Brevard Realty","Services",200,4690,2044,2646,"A - Less than $10K"]
["Gadget","2019-12-11","Wed","SkyWire, Inc.","Utilities",200,4691,1968,2728,"A - Less than $10K"]
["Gadget","2019-12-11","Wed","SkyWire, Inc.","Utilities",200,4696,1968,2728,"A - Less than $10K"]
["Gizmo","2019-07-28","Sun","Tennessee Moon","Retail",200,4717,2044,2678,"A - Less than $10K"]
["Gizmo","2019-07-28","Sun","Tennessee Moon","Retail",200,4722,2044,2678,"A - Less than $10K"]
["Gadget","2019-02-01","Fri","Ribbon Commander Framework","Utilities",200,4735,1968,2772,"A - Less than $10K"]
["Gadget","2019-02-16","Sat","SlinkyRN Excel Instruction and Consulting","Consulting",200,4737,1968,2774,{"$f":"VLOOKUP(G195,$M$2:$N$6,2,TRUE)","v":"A - Less than $10K"}]
["Gadget","2019-02-01","Fri","Ribbon Commander Framework","Utilities",200,4740,1968,2772,"A - Less than $10K"]
["Gadget","2019-02-16","Sat","SlinkyRN Excel Instruction and Consulting","Consulting",200,4742,1968,2774,"A - Less than $10K"]
["Gadget","2018-06-27","Wed","Safety Elements Ltd.","Services",200,4749,1968,2786,"A - Less than $10K"]
["Gadget","2018-06-27","Wed","Safety Elements Ltd.","Services",200,4754,1968,2786,"A - Less than $10K"]
["Gizmo","2018-03-21","Wed","Safety Elements Ltd.","Services",200,4779,2044,2740,"A - Less than $10K"]
["Gizmo","2018-03-21","Wed","Safety Elements Ltd.","Services",200,4784,2044,2740,"A - Less than $10K"]
["Gizmo","2018-05-20","Sun","Safety Elements Ltd.","Services",200,4841,2044,2802,"A - Less than $10K"]
["Gizmo","2018-05-20","Sun","Safety Elements Ltd.","Services",200,4846,2044,2802,"A - Less than $10K"]
["Gadget","2018-10-02","Tue","SlinkyRN Excel Instruction and Consulting","Consulting",200,4861,1968,2898,"A - Less than $10K"]
["Gadget","2018-10-02","Tue","SlinkyRN Excel Instruction and Consulting","Consulting",200,4866,1968,2898,"A - Less than $10K"]
["Gizmo","2019-07-18","Thu","St. Peter's Prep","Training",200,4897,2044,2858,"A - Less than $10K"]
["Gizmo","2019-07-18","Thu","St. Peter's Prep","Training",200,4902,2044,2858,"A - Less than $10K"]
["Doodads","2018-04-20","Fri","Tennessee Moon","Retail",200,4943,2044,2904,"A - Less than $10K"]
["Doodads","2018-04-20","Fri","Tennessee Moon","Retail",200,4948,2044,2904,"A - Less than $10K"]
["Gizmo","2019-09-18","Wed","Serving Brevard Realty","Services",200,4997,2044,2958,"A - Less than $10K"]
["Gizmo","2019-10-12","Sat","Ribbon Commander Framework","Utilities",200,4997,2044,2958,"A - Less than $10K"]
["Gizmo","2019-09-18","Wed","Serving Brevard Realty","Services",200,5002,2044,2958,"A - Less than $10K"]
["Gizmo","2019-10-12","Sat","Ribbon Commander Framework","Utilities",200,5002,2044,2958,"A - Less than $10K"]
["Gadget","2019-05-25","Sat","Safety Elements Ltd.","Services",300,5089,2541,2553,"A - Less than $10K"]
["Gadget","2019-05-25","Sat","Safety Elements Ltd.","Services",300,5094,2541,2553,"A - Less than $10K"]
["Widget","2018-02-09","Fri","Safety Elements Ltd.","Services",300,5152,2541,2616,"A - Less than $10K"]
["Widget","2018-02-09","Fri","Safety Elements Ltd.","Services",300,5157,2541,2616,"A - Less than $10K"]
["Widget","2018-03-23","Fri","SkyWire, Inc.","Utilities",300,5350,2541,2814,"A - Less than $10K"]
["Widget","2018-03-28","Wed","Ribbon Commander Framework","Utilities",300,5353,2541,2817,"A - Less than $10K"]
["Widget","2018-03-23","Fri","SkyWire, Inc.","Utilities",300,5355,2541,2814,"A - Less than $10K"]
["Widget","2018-03-28","Wed","Ribbon Commander Framework","Utilities",300,5358,2541,2817,"A - Less than $10K"]
["Widget","2018-04-02","Mon","Roto-Rooter","Services",300,5365,2541,2829,"A - Less than $10K"]
["Widget","2018-04-02","Mon","Roto-Rooter","Services",300,5370,2541,2829,"A - Less than $10K"]
["Widget","2018-04-24","Tue","Phare View Concepts","Consulting",300,5434,2541,2898,"A - Less than $10K"]
["Widget","2018-04-24","Tue","Phare View Concepts","Consulting",300,5439,2541,2898,"A - Less than $10K"]
["Widget","2018-09-14","Fri","St. Peter's Prep","Training",300,5452,2541,2916,"A - Less than $10K"]
["Widget","2018-09-14","Fri","St. Peter's Prep","Training",300,5457,2541,2916,"A - Less than $10K"]
["Widget","2018-07-31","Tue","Phare View Concepts","Consulting",300,5503,2541,2967,"A - Less than $10K"]
["Widget","2018-07-31","Tue","Phare View Concepts","Consulting",300,5508,2541,2967,"A - Less than $10K"]
["Widget","2018-02-01","Thu","Resource Optimizer","Utilities",300,5527,2541,2991,"A - Less than $10K"]
["Widget","2019-08-29","Thu","Safety Elements Ltd.","Services",300,5527,2541,2991,"A - Less than $10K"]
["Widget","2018-02-01","Thu","Resource Optimizer","Utilities",300,5532,2541,2991,"A - Less than $10K"]
["Widget","2019-08-29","Thu","Safety Elements Ltd.","Services",300,5532,2541,2991,"A - Less than $10K"]
["Widget","2018-11-30","Fri","Phare View Concepts","Consulting",300,5587,2541,3051,"A - Less than $10K"]
["Widget","2018-11-30","Fri","Phare View Concepts","Consulting",300,5592,2541,3051,"A - Less than $10K"]
["Widget","2018-02-20","Tue","SkyWire, Inc.","Utilities",300,5695,2541,3159,"A - Less than $10K"]
["Widget","2018-02-20","Tue","SkyWire, Inc.","Utilities",300,5700,2541,3159,"A - Less than $10K"]
["Widget","2018-09-11","Tue","Profology.com","Consulting",300,5821,2541,3285,"A - Less than $10K"]
["Widget","2018-09-11","Tue","Profology.com","Consulting",300,5826,2541,3285,"A - Less than $10K"]
["Widget","2019-12-21","Sat","SkyWire, Inc.","Utilities",300,5842,2541,3306,"A - Less than $10K"]
["Widget","2019-12-21","Sat","SkyWire, Inc.","Utilities",300,5847,2541,3306,"A - Less than $10K"]
["Doodads","2019-04-01","Mon","Steve Comer","Services",300,5854,2541,3318,"A - Less than $10K"]
["Widget","2019-08-28","Wed","Resource Optimizer","Utilities",300,5854,2541,3318,"A - Less than $10K"]
["Doodads","2019-04-01","Mon","Steve Comer","Services",300,5859,2541,3318,"A - Less than $10K"]
["Widget","2019-08-28","Wed","Resource Optimizer","Utilities",300,5859,2541,3318,"A - Less than $10K"]
["Gadget","2018-04-07","Sat","Reports Wand","Applications",300,5881,2541,3345,"A - Less than $10K"]
["Gadget","2018-04-07","Sat","Reports Wand","Applications",300,5886,2541,3345,"A - Less than $10K"]
["Widget","2018-08-17","Fri","Tennessee Moon","Retail",300,5899,2541,3363,"A - Less than $10K"]
["Widget","2018-08-17","Fri","Tennessee Moon","Retail",300,5904,2541,3363,"A - Less than $10K"]
["Gadget","2019-01-17","Thu","Profology.com","Consulting",300,5956,2952,3009,"A - Less than $10K"]
["Gadget","2019-01-17","Thu","Profology.com","Consulting",300,5961,2952,3009,"A - Less than $10K"]
["Widget","2018-07-15","Sun","Safety Elements Ltd.","Services",300,5962,2541,3426,"A - Less than $10K"]
["Widget","2018-07-15","Sun","Safety Elements Ltd.","Services",300,5967,2541,3426,"A - Less than $10K"]
["Gadget","2019-05-01","Wed","Orange County Health Department","Associations",300,6013,2952,3066,"A - Less than $10K"]
["Gadget","2019-05-01","Wed","Orange County Health Department","Associations",300,6018,2952,3066,"A - Less than $10K"]
["Widget","2019-02-08","Fri","SlinkyRN Excel Instruction and Consulting","Consulting",300,6040,2541,3504,"A - Less than $10K"]
["Widget","2019-02-08","Fri","SlinkyRN Excel Instruction and Consulting","Consulting",300,6045,2541,3504,"A - Less than $10K"]
["Gadget","2018-04-12","Thu","Resource Optimizer","Utilities",300,6058,2541,3522,"A - Less than $10K"]
["Gadget","2018-04-12","Thu","Resource Optimizer","Utilities",300,6063,2541,3522,{"$f":"VLOOKUP(G259,$M$2:$N$6,2,TRUE)","v":"A - Less than $10K"}]
["Gadget","2019-04-29","Mon","Reports Wand","Applications",300,6064,2541,3528,"A - Less than $10K"]
["Gadget","2019-04-29","Mon","Reports Wand","Applications",300,6069,2541,3528,"A - Less than $10K"]
["Widget","2018-08-14","Tue","Surten Excel","Consulting",300,6133,2541,3597,"A - Less than $10K"]
["Widget","2018-08-14","Tue","Surten Excel","Consulting",300,6138,2541,3597,"A - Less than $10K"]
["Gadget","2018-05-16","Wed","Serving Brevard Realty","Services",300,6151,2952,3204,"A - Less than $10K"]
["Widget","2019-08-21","Wed","Tennessee Moon","Retail",300,6151,2541,3615,"A - Less than $10K"]
["Gadget","2019-07-30","Tue","Profology.com","Consulting",300,6154,2952,3207,"A - Less than $10K"]
["Gadget","2018-05-16","Wed","Serving Brevard Realty","Services",300,6156,2952,3204,"A - Less than $10K"]
["Widget","2019-08-21","Wed","Tennessee Moon","Retail",300,6156,2541,3615,"A - Less than $10K"]
["Gadget","2019-07-30","Tue","Profology.com","Consulting",300,6159,2952,3207,"A - Less than $10K"]
["Widget","2019-01-24","Thu","Phare View Concepts","Consulting",300,6202,2541,3666,"A - Less than $10K"]
["Widget","2019-01-24","Thu","Phare View Concepts","Consulting",300,6207,2541,3666,"A - Less than $10K"]
["Gadget","2019-07-23","Tue","Resource Optimizer","Utilities",300,6223,2952,3276,"A - Less than $10K"]
["Gadget","2019-07-23","Tue","Resource Optimizer","Utilities",300,6228,2952,3276,"A - Less than $10K"]
["Gadget","2019-01-25","Fri","Reports Wand","Applications",300,6235,2952,3288,"A - Less than $10K"]
["Gadget","2019-01-25","Fri","Reports Wand","Applications",300,6240,2952,3288,"A - Less than $10K"]
["Widget","2018-01-12","Fri","Safety Elements Ltd.","Services",300,6262,2541,3726,"A - Less than $10K"]
["Widget","2018-01-12","Fri","Safety Elements Ltd.","Services",300,6267,2541,3726,"A - Less than $10K"]
["Widget","2018-08-29","Wed","Serving Brevard Realty","Services",300,6304,2541,3768,"A - Less than $10K"]
["Widget","2018-08-29","Wed","Serving Brevard Realty","Services",300,6309,2541,3768,"A - Less than $10K"]
["Gizmo","2019-08-25","Sun","SpringBoard","Utilities",300,6433,3066,3372,"A - Less than $10K"]
["Gizmo","2019-08-25","Sun","SpringBoard","Utilities",300,6438,3066,3372,"A - Less than $10K"]
["Gadget","2018-11-24","Sat","Ribbon Commander Framework","Utilities",300,6457,2952,3510,"A - Less than $10K"]
["Gadget","2018-11-24","Sat","Ribbon Commander Framework","Utilities",300,6462,2952,3510,"A - Less than $10K"]
["Gadget","2019-06-12","Wed","Phare View Concepts","Consulting",300,6472,2952,3525,"A - Less than $10K"]
["Gadget","2019-06-12","Wed","Phare View Concepts","Consulting",300,6477,2952,3525,"A - Less than $10K"]
["Gizmo","2018-10-17","Wed","Phare View Concepts","Consulting",300,6490,3066,3429,"A - Less than $10K"]
["Gizmo","2018-10-17","Wed","Phare View Concepts","Consulting",300,6495,3066,3429,"A - Less than $10K"]
["Gadget","2019-08-14","Wed","Roto-Rooter","Services",300,6517,2952,3570,"A - Less than $10K"]
["Gadget","2019-08-14","Wed","Roto-Rooter","Services",300,6522,2952,3570,"A - Less than $10K"]
["Gadget","2019-09-25","Wed","Profology.com","Consulting",300,6577,2952,3630,"A - Less than $10K"]
["Gadget","2019-09-25","Wed","Profology.com","Consulting",300,6582,2952,3630,"A - Less than $10K"]
["Gadget","2018-04-04","Wed","Steve Comer","Services",300,6583,2952,3636,"A - Less than $10K"]
["Gadget","2018-04-04","Wed","Steve Comer","Services",300,6588,2952,3636,"A - Less than $10K"]
["Gizmo","2018-05-30","Wed","Roto-Rooter","Services",300,6655,3066,3594,"A - Less than $10K"]
["Gizmo","2018-05-30","Wed","Roto-Rooter","Services",300,6660,3066,3594,"A - Less than $10K"]
["Gadget","2018-01-30","Tue","Profology.com","Consulting",300,6709,2952,3762,"A - Less than $10K"]
["Gadget","2018-01-30","Tue","Profology.com","Consulting",300,6714,2952,3762,"A - Less than $10K"]
["Gizmo","2018-12-15","Sat","Phare View Concepts","Consulting",300,6727,3066,3666,"A - Less than $10K"]
["Gadget","2019-01-22","Tue","Roto-Rooter","Services",300,6730,2952,3783,"A - Less than $10K"]
["Gizmo","2018-12-15","Sat","Phare View Concepts","Consulting",300,6732,3066,3666,"A - Less than $10K"]
["Gadget","2019-01-22","Tue","Roto-Rooter","Services",300,6735,2952,3783,"A - Less than $10K"]
["Gizmo","2019-12-16","Mon","Surten Excel","Consulting",300,6739,3066,3678,"A - Less than $10K"]
["Gizmo","2019-12-16","Mon","Surten Excel","Consulting",300,6744,3066,3678,"A - Less than $10K"]
["Gizmo","2018-03-22","Thu","Serving Brevard Realty","Services",300,6760,3066,3699,"A - Less than $10K"]
["Gizmo","2018-03-22","Thu","Serving Brevard Realty","Services",300,6765,3066,3699,"A - Less than $10K"]
["Gizmo","2019-05-10","Fri","Profology.com","Consulting",300,6784,3066,3723,"A - Less than $10K"]
["Gizmo","2019-05-10","Fri","Profology.com","Consulting",300,6789,3066,3723,"A - Less than $10K"]
["Widget","2019-01-05","Sat","Orange County Health Department","Associations",400,6855,3388,3472,"A - Less than $10K"]
["Widget","2019-01-05","Sat","Orange County Health Department","Associations",400,6860,3388,3472,"A - Less than $10K"]
["Gizmo","2018-05-05","Sat","St. Peter's Prep","Training",300,6862,3066,3801,"A - Less than $10K"]
["Gizmo","2018-05-05","Sat","St. Peter's Prep","Training",300,6867,3066,3801,"A - Less than $10K"]
["Widget","2019-11-20","Wed","Safety Elements Ltd.","Services",400,6875,3388,3492,"A - Less than $10K"]
["Widget","2019-11-20","Wed","Safety Elements Ltd.","Services",400,6880,3388,3492,"A - Less than $10K"]
["Widget","2019-10-02","Wed","Surten Excel","Consulting",400,6939,3388,3556,"A - Less than $10K"]
["Widget","2019-10-02","Wed","Surten Excel","Consulting",400,6944,3388,3556,"A - Less than $10K"]
["Gizmo","2018-10-13","Sat","Roto-Rooter","Services",300,7027,3066,3966,"A - Less than $10K"]
["Gadget","2019-01-21","Mon","Serving Brevard Realty","Services",300,7027,2952,4080,"A - Less than $10K"]
["Gizmo","2018-10-13","Sat","Roto-Rooter","Services",300,7032,3066,3966,"A - Less than $10K"]
["Gadget","2019-01-21","Mon","Serving Brevard Realty","Services",300,7032,2952,4080,"A - Less than $10K"]
["Gadget","2018-11-21","Wed","Safety Elements Ltd.","Services",300,7048,2952,4101,"A - Less than $10K"]
["Gadget","2018-11-21","Wed","Safety Elements Ltd.","Services",300,7053,2952,4101,"A - Less than $10K"]
["Gadget","2018-03-20","Tue","Reports Wand","Applications",400,7127,3388,3744,"A - Less than $10K"]
["Widget","2018-01-29","Mon","Phare View Concepts","Consulting",400,7131,3388,3748,{"$f":"VLOOKUP(G323,$M$2:$N$6,2,TRUE)","v":"A - Less than $10K"}]
["Gadget","2018-03-20","Tue","Reports Wand","Applications",400,7132,3388,3744,"A - Less than $10K"]
["Widget","2018-01-29","Mon","Phare View Concepts","Consulting",400,7136,3388,3748,"A - Less than $10K"]
["Widget","2019-02-20","Wed","Steve Comer","Services",400,7147,3388,3764,"A - Less than $10K"]
["Widget","2019-02-20","Wed","Steve Comer","Services",400,7152,3388,3764,"A - Less than $10K"]
["Gizmo","2018-07-03","Tue","Serving Brevard Realty","Services",300,7162,3066,4101,"A - Less than $10K"]
["Gizmo","2018-07-03","Tue","Serving Brevard Realty","Services",300,7167,3066,4101,"A - Less than $10K"]
["Widget","2019-02-09","Sat","Roto-Rooter","Services",400,7175,3388,3792,"A - Less than $10K"]
["Widget","2019-02-09","Sat","Roto-Rooter","Services",400,7180,3388,3792,"A - Less than $10K"]
["Gadget","2019-04-03","Wed","Surten Excel","Consulting",300,7228,2952,4281,"A - Less than $10K"]
["Gadget","2019-04-03","Wed","Surten Excel","Consulting",300,7233,2952,4281,"A - Less than $10K"]
["Gadget","2019-05-11","Sat","SpringBoard","Utilities",300,7240,2952,4293,"A - Less than $10K"]
["Gadget","2019-05-11","Sat","SpringBoard","Utilities",300,7245,2952,4293,"A - Less than $10K"]
["Gizmo","2019-03-13","Wed","Resource Optimizer","Utilities",300,7300,3066,4239,"A - Less than $10K"]
["Gizmo","2019-03-13","Wed","Resource Optimizer","Utilities",300,7305,3066,4239,"A - Less than $10K"]
["Widget","2019-04-22","Mon","Reports Wand","Applications",400,7371,3388,3988,"A - Less than $10K"]
["Widget","2019-04-22","Mon","Reports Wand","Applications",400,7376,3388,3988,"A - Less than $10K"]
["Widget","2018-10-18","Thu","Serving Brevard Realty","Services",400,7515,3388,4132,"A - Less than $10K"]
["Widget","2018-10-18","Thu","Serving Brevard Realty","Services",400,7520,3388,4132,"A - Less than $10K"]
["Gizmo","2018-11-29","Thu","SpringBoard","Utilities",300,7564,3066,4503,"A - Less than $10K"]
["Gizmo","2018-11-29","Thu","SpringBoard","Utilities",300,7569,3066,4503,"A - Less than $10K"]
["Gizmo","2018-07-05","Thu","SpringBoard","Utilities",300,7588,3066,4527,"A - Less than $10K"]
["Gizmo","2018-07-05","Thu","SpringBoard","Utilities",300,7593,3066,4527,"A - Less than $10K"]
["Widget","2019-04-04","Thu","Roto-Rooter","Services",400,7747,3388,4364,"A - Less than $10K"]
["Widget","2019-04-04","Thu","Roto-Rooter","Services",400,7752,3388,4364,"A - Less than $10K"]
["Widget","2019-04-26","Fri","Serving Brevard Realty","Services",400,7847,3388,4464,"A - Less than $10K"]
["Widget","2019-04-26","Fri","Serving Brevard Realty","Services",400,7852,3388,4464,"A - Less than $10K"]
["Widget","2018-09-05","Wed","Steve Comer","Services",400,7939,3388,4556,"A - Less than $10K"]
["Widget","2018-09-05","Wed","Steve Comer","Services",400,7944,3388,4556,"A - Less than $10K"]
["Widget","2018-04-14","Sat","Tennessee Moon","Retail",400,8011,3388,4628,"A - Less than $10K"]
["Widget","2018-04-14","Sat","Tennessee Moon","Retail",400,8016,3388,4628,"A - Less than $10K"]
["Gadget","2018-05-07","Mon","Reports Wand","Applications",400,8047,3936,4116,"A - Less than $10K"]
["Gadget","2018-05-07","Mon","Reports Wand","Applications",400,8052,3936,4116,"A - Less than $10K"]
["Widget","2018-03-16","Fri","Ribbon Commander Framework","Utilities",400,8111,3388,4728,"A - Less than $10K"]
["Widget","2018-03-16","Fri","Ribbon Commander Framework","Utilities",400,8116,3388,4728,"A - Less than $10K"]
["Widget","2018-01-26","Fri","Tennessee Moon","Retail",400,8123,3388,4740,"A - Less than $10K"]
["Widget","2019-04-10","Wed","Safety Elements Ltd.","Services",400,8127,3388,4744,"A - Less than $10K"]
["Widget","2018-01-26","Fri","Tennessee Moon","Retail",400,8128,3388,4740,"A - Less than $10K"]
["Widget","2019-04-10","Wed","Safety Elements Ltd.","Services",400,8132,3388,4744,"A - Less than $10K"]
["Widget","2019-01-23","Wed","SkyWire, Inc.","Utilities",400,8159,3388,4776,"A - Less than $10K"]
["Widget","2019-01-23","Wed","SkyWire, Inc.","Utilities",400,8164,3388,4776,"A - Less than $10K"]
["Widget","2018-11-08","Thu","Serving Brevard Realty","Services",400,8191,3388,4808,"A - Less than $10K"]
["Widget","2018-11-08","Thu","Serving Brevard Realty","Services",400,8196,3388,4808,"A - Less than $10K"]
["Gadget","2019-11-24","Sun","SlinkyRN Excel Instruction and Consulting","Consulting",400,8199,3936,4268,"A - Less than $10K"]
["Gadget","2019-11-24","Sun","SlinkyRN Excel Instruction and Consulting","Consulting",400,8204,3936,4268,"A - Less than $10K"]
["Gizmo","2019-12-05","Thu","Tennessee Moon","Retail",400,8279,4088,4196,"A - Less than $10K"]
["Gizmo","2019-12-05","Thu","Tennessee Moon","Retail",400,8284,4088,4196,"A - Less than $10K"]
["Widget","2018-01-07","Sun","Resource Optimizer","Utilities",400,8451,3388,5068,"A - Less than $10K"]
["Widget","2018-01-07","Sun","Resource Optimizer","Utilities",400,8456,3388,5068,"A - Less than $10K"]
["Gadget","2019-11-28","Thu","Reports Wand","Applications",400,8459,3936,4528,"A - Less than $10K"]
["Gadget","2018-11-05","Mon","Phare View Concepts","Consulting",400,8463,3388,5080,"A - Less than $10K"]
["Gadget","2019-11-28","Thu","Reports Wand","Applications",400,8464,3936,4528,"A - Less than $10K"]
["Gadget","2018-11-05","Mon","Phare View Concepts","Consulting",400,8468,3388,5080,"A - Less than $10K"]
["Gizmo","2019-11-25","Mon","SkyWire, Inc.","Utilities",400,8551,4088,4468,"A - Less than $10K"]
["Gizmo","2018-10-10","Wed","SlinkyRN Excel Instruction and Consulting","Consulting",400,8555,4088,4472,"A - Less than $10K"]
["Gizmo","2019-11-25","Mon","SkyWire, Inc.","Utilities",400,8556,4088,4468,"A - Less than $10K"]
["Gizmo","2018-10-10","Wed","SlinkyRN Excel Instruction and Consulting","Consulting",400,8560,4088,4472,"A - Less than $10K"]
["Gizmo","2019-07-07","Sun","Roto-Rooter","Services",400,8575,4088,4492,"A - Less than $10K"]
["Gizmo","2019-07-07","Sun","Roto-Rooter","Services",400,8580,4088,4492,"A - Less than $10K"]
["Gadget","2019-09-22","Sun","SlinkyRN Excel Instruction and Consulting","Consulting",400,8587,3936,4656,"A - Less than $10K"]
["Gadget","2019-09-22","Sun","SlinkyRN Excel Instruction and Consulting","Consulting",400,8592,3936,4656,"A - Less than $10K"]
["Gizmo","2019-03-03","Sun","Safety Elements Ltd.","Services",400,8615,4088,4532,"A - Less than $10K"]
["Gizmo","2019-03-03","Sun","Safety Elements Ltd.","Services",400,8620,4088,4532,"A - Less than $10K"]
["Gadget","2018-04-04","Wed","Resource Optimizer","Utilities",400,8627,3936,4696,"A - Less than $10K"]
["Gadget","2018-04-04","Wed","Resource Optimizer","Utilities",400,8632,3936,4696,{"$f":"VLOOKUP(G387,$M$2:$N$6,2,TRUE)","v":"A - Less than $10K"}]
["Gadget","2018-02-27","Tue","Steve Comer","Services",400,8703,3936,4772,"A - Less than $10K"]
["Gadget","2018-02-27","Tue","Steve Comer","Services",400,8708,3936,4772,"A - Less than $10K"]
["Widget","2019-09-29","Sun","Ribbon Commander Framework","Utilities",500,8710,4235,4480,"A - Less than $10K"]
["Widget","2019-09-29","Sun","Ribbon Commander Framework","Utilities",500,8715,4235,4480,"A - Less than $10K"]
["Widget","2018-12-22","Sat","Steve Comer","Services",500,8720,4235,4490,"A - Less than $10K"]
["Widget","2018-12-22","Sat","Steve Comer","Services",500,8725,4235,4490,"A - Less than $10K"]
["Gizmo","2019-03-22","Fri","Safety Elements Ltd.","Services",400,8727,4088,4644,"A - Less than $10K"]
["Gizmo","2019-03-22","Fri","Safety Elements Ltd.","Services",400,8732,4088,4644,"A - Less than $10K"]
["Gizmo","2018-08-25","Sat","St. Peter's Prep","Training",400,8739,4088,4656,"A - Less than $10K"]
["Gizmo","2018-08-25","Sat","St. Peter's Prep","Training",400,8744,4088,4656,"A - Less than $10K"]
["Gadget","2019-04-12","Fri","Reports Wand","Applications",400,8771,3936,4840,"A - Less than $10K"]
["Widget","2019-06-14","Fri","Surten Excel","Consulting",500,8775,4235,4545,"A - Less than $10K"]
["Gadget","2019-04-12","Fri","Reports Wand","Applications",400,8776,3936,4840,"A - Less than $10K"]
["Widget","2019-06-14","Fri","Surten Excel","Consulting",500,8780,4235,4545,"A - Less than $10K"]
["Widget","2018-05-11","Fri","Serving Brevard Realty","Services",500,8780,4235,4550,"A - Less than $10K"]
["Widget","2018-05-11","Fri","Serving Brevard Realty","Services",500,8785,4235,4550,"A - Less than $10K"]
["Gizmo","2019-06-27","Thu","St. Peter's Prep","Training",400,8799,4088,4716,"A - Less than $10K"]
["Gizmo","2019-06-27","Thu","St. Peter's Prep","Training",400,8804,4088,4716,"A - Less than $10K"]
["Gizmo","2018-07-11","Wed","SkyWire, Inc.","Utilities",400,8871,4088,4788,"A - Less than $10K"]
["Gizmo","2018-07-11","Wed","SkyWire, Inc.","Utilities",400,8876,4088,4788,"A - Less than $10K"]
["Widget","2019-10-11","Fri","Safety Elements Ltd.","Services",500,8935,4235,4705,"A - Less than $10K"]
["Widget","2019-10-11","Fri","Safety Elements Ltd.","Services",500,8940,4235,4705,"A - Less than $10K"]
["Widget","2019-11-15","Fri","Phare View Concepts","Consulting",500,8965,4235,4735,"A - Less than $10K"]
["Widget","2019-11-15","Fri","Phare View Concepts","Consulting",500,8970,4235,4735,"A - Less than $10K"]
["Gizmo","2019-06-07","Fri","Safety Elements Ltd.","Services",400,9059,4088,4976,"A - Less than $10K"]
["Gizmo","2019-06-07","Fri","Safety Elements Ltd.","Services",400,9064,4088,4976,"A - Less than $10K"]
["Gadget","2019-02-19","Tue","Surten Excel","Consulting",400,9083,3936,5152,"A - Less than $10K"]
["Gadget","2019-02-19","Tue","Surten Excel","Consulting",400,9088,3936,5152,"A - Less than $10K"]
["Gizmo","2019-01-12","Sat","Ribbon Commander Framework","Utilities",400,9139,4088,5056,"A - Less than $10K"]
["Gizmo","2019-01-12","Sat","Ribbon Commander Framework","Utilities",400,9144,4088,5056,"A - Less than $10K"]
["Gizmo","2018-01-04","Thu","Profology.com","Consulting",400,9147,4088,5064,"A - Less than $10K"]
["Widget","2019-05-13","Mon","Serving Brevard Realty","Services",500,9150,4235,4920,"A - Less than $10K"]
["Gizmo","2019-05-15","Wed","Reports Wand","Applications",400,9151,4088,5068,"A - Less than $10K"]
["Gizmo","2018-01-04","Thu","Profology.com","Consulting",400,9152,4088,5064,"A - Less than $10K"]
["Widget","2019-05-13","Mon","Serving Brevard Realty","Services",500,9155,4235,4920,"A - Less than $10K"]
["Gizmo","2019-05-15","Wed","Reports Wand","Applications",400,9156,4088,5068,"A - Less than $10K"]
["Gizmo","2019-01-04","Fri","SkyWire, Inc.","Utilities",400,9199,4088,5116,"A - Less than $10K"]
["Gizmo","2019-01-04","Fri","SkyWire, Inc.","Utilities",400,9204,4088,5116,"A - Less than $10K"]
["Gizmo","2019-03-16","Sat","Roto-Rooter","Services",400,9235,4088,5152,"A - Less than $10K"]
["Gizmo","2019-03-16","Sat","Roto-Rooter","Services",400,9240,4088,5152,"A - Less than $10K"]
["Widget","2018-01-15","Mon","Serving Brevard Realty","Services",500,9340,4235,5110,"A - Less than $10K"]
["Widget","2018-01-15","Mon","Serving Brevard Realty","Services",500,9345,4235,5110,"A - Less than $10K"]
["Widget","2018-09-25","Tue","Profology.com","Consulting",500,9345,4235,5115,"A - Less than $10K"]
["Widget","2018-09-25","Tue","Profology.com","Consulting",500,9350,4235,5115,"A - Less than $10K"]
["Gadget","2018-05-13","Sun","Ribbon Commander Framework","Utilities",500,9375,4235,5145,"A - Less than $10K"]
["Gizmo","2018-08-16","Thu","Roto-Rooter","Services",400,9379,4088,5296,"A - Less than $10K"]
["Gadget","2018-05-13","Sun","Ribbon Commander Framework","Utilities",500,9380,4235,5145,"A - Less than $10K"]
["Gizmo","2018-08-16","Thu","Roto-Rooter","Services",400,9384,4088,5296,"A - Less than $10K"]
["Widget","2018-12-28","Fri","Roto-Rooter","Services",500,9455,4235,5225,"A - Less than $10K"]
["Widget","2018-12-28","Fri","Roto-Rooter","Services",500,9460,4235,5225,"A - Less than $10K"]
["Gadget","2018-10-31","Wed","Orange County Health Department","Associations",500,9470,4235,5240,"A - Less than $10K"]
["Gadget","2018-10-31","Wed","Orange County Health Department","Associations",500,9475,4235,5240,"A - Less than $10K"]
["Gadget","2019-11-23","Sat","Phare View Concepts","Consulting",400,9479,3936,5548,"A - Less than $10K"]
["Gadget","2019-11-23","Sat","Phare View Concepts","Consulting",400,9484,3936,5548,"A - Less than $10K"]
["Widget","2019-04-05","Fri","Surten Excel","Consulting",500,9570,4235,5340,"A - Less than $10K"]
["Widget","2019-04-05","Fri","Surten Excel","Consulting",500,9575,4235,5340,"A - Less than $10K"]
["Widget","2018-05-14","Mon","Profology.com","Consulting",500,9630,4235,5400,"A - Less than $10K"]
["Widget","2018-05-14","Mon","Profology.com","Consulting",500,9635,4235,5400,"A - Less than $10K"]
["Gizmo","2018-12-09","Sun","Ribbon Commander Framework","Utilities",400,9655,4088,5572,"A - Less than $10K"]
["Gizmo","2018-12-09","Sun","Ribbon Commander Framework","Utilities",400,9660,4088,5572,"A - Less than $10K"]
["Gadget","2019-09-26","Thu","Tennessee Moon","Retail",400,9667,3936,5736,"A - Less than $10K"]
["Gadget","2019-09-26","Thu","Tennessee Moon","Retail",400,9672,3936,5736,"A - Less than $10K"]
["Gizmo","2018-08-03","Fri","Ribbon Commander Framework","Utilities",400,9699,4088,5616,"A - Less than $10K"]
["Gizmo","2018-08-03","Fri","Ribbon Commander Framework","Utilities",400,9704,4088,5616,{"$f":"VLOOKUP(G451,$M$2:$N$6,2,TRUE)","v":"A - Less than $10K"}]
["Gadget","2019-05-13","Mon","Safety Elements Ltd.","Services",400,9755,3936,5824,"A - Less than $10K"]
["Gadget","2019-05-13","Mon","Safety Elements Ltd.","Services",400,9760,3936,5824,"A - Less than $10K"]
["Gizmo","2019-07-02","Tue","Resource Optimizer","Utilities",400,9811,4088,5728,"A - Less than $10K"]
["Gizmo","2019-07-02","Tue","Resource Optimizer","Utilities",400,9816,4088,5728,"A - Less than $10K"]
["Widget","2019-03-28","Thu","St. Peter's Prep","Training",500,9850,4235,5620,"A - Less than $10K"]
["Widget","2019-03-28","Thu","St. Peter's Prep","Training",500,9855,4235,5620,"A - Less than $10K"]
["Gadget","2018-11-28","Wed","Serving Brevard Realty","Services",500,9885,4920,4970,"A - Less than $10K"]
["Gadget","2018-11-28","Wed","Serving Brevard Realty","Services",500,9890,4920,4970,"A - Less than $10K"]
["Gizmo","2019-01-30","Wed","Roto-Rooter","Services",400,10039,4088,5956,"B - $10K to $20K"]
["Gizmo","2019-01-30","Wed","Roto-Rooter","Services",400,10044,4088,5956,"B - $10K to $20K"]
["Widget","2018-03-07","Wed","Profology.com","Consulting",500,10150,4235,5920,"B - $10K to $20K"]
["Widget","2018-03-07","Wed","Profology.com","Consulting",500,10155,4235,5920,"B - $10K to $20K"]
["Gadget","2018-05-22","Tue","Safety Elements Ltd.","Services",500,10190,4920,5275,"B - $10K to $20K"]
["Gadget","2018-05-22","Tue","Safety Elements Ltd.","Services",500,10195,4920,5275,"B - $10K to $20K"]
["Widget","2019-01-02","Wed","Surten Excel","Consulting",500,10240,4235,6010,"B - $10K to $20K"]
["Widget","2019-01-02","Wed","Surten Excel","Consulting",500,10245,4235,6010,"B - $10K to $20K"]
["Widget","2018-12-29","Sat","Ribbon Commander Framework","Utilities",600,10285,5082,5208,"B - $10K to $20K"]
["Widget","2018-12-29","Sat","Ribbon Commander Framework","Utilities",600,10290,5082,5208,"B - $10K to $20K"]
["Widget","2018-09-04","Tue","Phare View Concepts","Consulting",500,10290,4235,6060,"B - $10K to $20K"]
["Gadget","2019-12-13","Fri","SlinkyRN Excel Instruction and Consulting","Consulting",500,10290,4920,5375,"B - $10K to $20K"]
["Widget","2018-09-04","Tue","Phare View Concepts","Consulting",500,10295,4235,6060,"B - $10K to $20K"]
["Gadget","2019-12-13","Fri","SlinkyRN Excel Instruction and Consulting","Consulting",500,10295,4920,5375,"B - $10K to $20K"]
["Widget","2018-06-23","Sat","Profology.com","Consulting",500,10325,4235,6095,"B - $10K to $20K"]
["Widget","2018-06-23","Sat","Profology.com","Consulting",500,10330,4235,6095,"B - $10K to $20K"]
["Gizmo","2019-12-15","Sun","Ribbon Commander Framework","Utilities",500,10375,5110,5270,"B - $10K to $20K"]
["Gizmo","2019-12-15","Sun","Ribbon Commander Framework","Utilities",500,10380,5110,5270,"B - $10K to $20K"]
["Widget","2018-02-19","Mon","Profology.com","Consulting",500,10380,4235,6150,"B - $10K to $20K"]
["Gizmo","2019-05-18","Sat","Phare View Concepts","Consulting",500,10380,5110,5275,"B - $10K to $20K"]
["Widget","2018-02-19","Mon","Profology.com","Consulting",500,10385,4235,6150,"B - $10K to $20K"]
["Gizmo","2019-05-18","Sat","Phare View Concepts","Consulting",500,10385,5110,5275,"B - $10K to $20K"]
["Gizmo","2019-05-07","Tue","SkyWire, Inc.","Utilities",500,10395,5110,5290,"B - $10K to $20K"]
["Widget","2019-06-13","Thu","SkyWire, Inc.","Utilities",600,10399,5082,5322,"B - $10K to $20K"]
["Gizmo","2019-05-07","Tue","SkyWire, Inc.","Utilities",500,10400,5110,5290,"B - $10K to $20K"]
["Widget","2019-06-13","Thu","SkyWire, Inc.","Utilities",600,10404,5082,5322,"B - $10K to $20K"]
["Gizmo","2018-03-01","Thu","Tennessee Moon","Retail",500,10440,5110,5335,"B - $10K to $20K"]
["Gadget","2019-01-27","Sun","Roto-Rooter","Services",500,10440,4235,6210,"B - $10K to $20K"]
["Gizmo","2018-03-01","Thu","Tennessee Moon","Retail",500,10445,5110,5335,"B - $10K to $20K"]
["Gadget","2019-01-27","Sun","Roto-Rooter","Services",500,10445,4235,6210,"B - $10K to $20K"]
["Widget","2019-04-07","Sun","Ribbon Commander Framework","Utilities",500,10455,4235,6225,"B - $10K to $20K"]
["Widget","2019-04-07","Sun","Ribbon Commander Framework","Utilities",500,10460,4235,6225,"B - $10K to $20K"]
["Gadget","2018-12-25","Tue","Roto-Rooter","Services",500,10470,4920,5555,"B - $10K to $20K"]
["Gadget","2018-12-25","Tue","Roto-Rooter","Services",500,10475,4920,5555,"B - $10K to $20K"]
["Gizmo","2018-10-16","Tue","Surten Excel","Consulting",500,10545,5110,5440,"B - $10K to $20K"]
["Gizmo","2018-10-16","Tue","Surten Excel","Consulting",500,10550,5110,5440,"B - $10K to $20K"]
["Widget","2018-09-23","Sun","Serving Brevard Realty","Services",600,10597,5082,5520,"B - $10K to $20K"]
["Widget","2018-09-23","Sun","Serving Brevard Realty","Services",600,10602,5082,5520,"B - $10K to $20K"]
["Gizmo","2018-11-04","Sun","Reports Wand","Applications",500,10640,5110,5535,"B - $10K to $20K"]
["Gizmo","2018-11-04","Sun","Reports Wand","Applications",500,10645,5110,5535,"B - $10K to $20K"]
["Gizmo","2018-06-12","Tue","SlinkyRN Excel Instruction and Consulting","Consulting",500,10645,5110,5540,"B - $10K to $20K"]
["Gizmo","2018-06-12","Tue","SlinkyRN Excel Instruction and Consulting","Consulting",500,10650,5110,5540,"B - $10K to $20K"]
["Gadget","2018-12-05","Wed","Orange County Health Department","Associations",500,10755,4920,5840,"B - $10K to $20K"]
["Gadget","2018-12-05","Wed","Orange County Health Department","Associations",500,10760,4920,5840,"B - $10K to $20K"]
["Gizmo","2018-03-14","Wed","Resource Optimizer","Utilities",500,10930,5110,5825,"B - $10K to $20K"]
["Gizmo","2018-03-14","Wed","Resource Optimizer","Utilities",500,10935,5110,5825,"B - $10K to $20K"]
["Gizmo","2019-10-19","Sat","Roto-Rooter","Services",500,10935,5110,5830,"B - $10K to $20K"]
["Gizmo","2019-10-19","Sat","Roto-Rooter","Services",500,10940,5110,5830,"B - $10K to $20K"]
["Gadget","2018-10-25","Thu","Surten Excel","Consulting",500,10950,4920,6035,"B - $10K to $20K"]
["Gadget","2018-10-25","Thu","Surten Excel","Consulting",500,10955,4920,6035,"B - $10K to $20K"]
["Gizmo","2018-08-28","Tue","SlinkyRN Excel Instruction and Consulting","Consulting",500,10985,5110,5880,"B - $10K to $20K"]
["Gizmo","2018-08-28","Tue","SlinkyRN Excel Instruction and Consulting","Consulting",500,10990,5110,5880,"B - $10K to $20K"]
["Gizmo","2019-05-12","Sun","Reports Wand","Applications",500,10995,5110,5890,"B - $10K to $20K"]
["Gizmo","2019-05-12","Sun","Reports Wand","Applications",500,11000,5110,5890,"B - $10K to $20K"]
["Widget","2018-02-20","Tue","Serving Brevard Realty","Services",600,11119,5082,6042,"B - $10K to $20K"]
["Widget","2018-02-20","Tue","Serving Brevard Realty","Services",600,11124,5082,6042,{"$f":"VLOOKUP(G515,$M$2:$N$6,2,TRUE)","v":"B - $10K to $20K"}]
["Gadget","2018-05-21","Mon","Ribbon Commander Framework","Utilities",600,11203,5082,6126,"B - $10K to $20K"]
["Gadget","2018-05-21","Mon","Ribbon Commander Framework","Utilities",600,11208,5082,6126,"B - $10K to $20K"]
["Gadget","2018-10-22","Mon","Profology.com","Consulting",500,11215,4920,6300,"B - $10K to $20K"]
["Gadget","2018-10-22","Mon","Profology.com","Consulting",500,11220,4920,6300,"B - $10K to $20K"]
["Gadget","2019-07-19","Fri","Serving Brevard Realty","Services",500,11230,4920,6315,"B - $10K to $20K"]
["Gadget","2019-07-19","Fri","Serving Brevard Realty","Services",500,11235,4920,6315,"B - $10K to $20K"]
["Gizmo","2019-01-03","Thu","SlinkyRN Excel Instruction and Consulting","Consulting",500,11235,5110,6130,"B - $10K to $20K"]
["Gizmo","2019-01-03","Thu","SlinkyRN Excel Instruction and Consulting","Consulting",500,11240,5110,6130,"B - $10K to $20K"]
["Gadget","2019-10-25","Fri","Surten Excel","Consulting",500,11245,4920,6330,"B - $10K to $20K"]
["Gadget","2019-10-25","Fri","Surten Excel","Consulting",500,11250,4920,6330,"B - $10K to $20K"]
["Widget","2018-12-19","Wed","Safety Elements Ltd.","Services",600,11269,5082,6192,"B - $10K to $20K"]
["Widget","2018-12-19","Wed","Safety Elements Ltd.","Services",600,11274,5082,6192,"B - $10K to $20K"]
["Gadget","2018-11-11","Sun","Reports Wand","Applications",500,11290,4920,6375,"B - $10K to $20K"]
["Gadget","2018-11-11","Sun","Reports Wand","Applications",500,11295,4920,6375,"B - $10K to $20K"]
["Gadget","2019-11-21","Thu","Serving Brevard Realty","Services",500,11325,4920,6410,"B - $10K to $20K"]
["Gadget","2019-11-21","Thu","Serving Brevard Realty","Services",500,11330,4920,6410,"B - $10K to $20K"]
["Widget","2018-02-17","Sat","Roto-Rooter","Services",600,11425,5082,6348,"B - $10K to $20K"]
["Gadget","2019-10-26","Sat","Ribbon Commander Framework","Utilities",500,11425,4920,6510,"B - $10K to $20K"]
["Widget","2018-02-17","Sat","Roto-Rooter","Services",600,11430,5082,6348,"B - $10K to $20K"]
["Gadget","2019-10-26","Sat","Ribbon Commander Framework","Utilities",500,11430,4920,6510,"B - $10K to $20K"]
["Gadget","2018-04-25","Wed","Serving Brevard Realty","Services",500,11430,4920,6515,"B - $10K to $20K"]
["Gadget","2018-04-25","Wed","Serving Brevard Realty","Services",500,11435,4920,6515,"B - $10K to $20K"]
["Gizmo","2019-11-28","Thu","Safety Elements Ltd.","Services",500,11465,5110,6360,"B - $10K to $20K"]
["Gizmo","2019-11-28","Thu","Safety Elements Ltd.","Services",500,11470,5110,6360,"B - $10K to $20K"]
["Gizmo","2018-02-23","Fri","SkyWire, Inc.","Utilities",500,11520,5110,6415,"B - $10K to $20K"]
["Gizmo","2018-02-23","Fri","SkyWire, Inc.","Utilities",500,11525,5110,6415,"B - $10K to $20K"]
["Gadget","2019-10-16","Wed","Safety Elements Ltd.","Services",500,11525,4920,6610,"B - $10K to $20K"]
["Gadget","2019-10-16","Wed","Safety Elements Ltd.","Services",500,11530,4920,6610,"B - $10K to $20K"]
["Gadget","2018-07-18","Wed","Tennessee Moon","Retail",500,11540,4920,6625,"B - $10K to $20K"]
["Gadget","2018-07-18","Wed","Tennessee Moon","Retail",500,11545,4920,6625,"B - $10K to $20K"]
["Gadget","2019-09-10","Tue","Phare View Concepts","Consulting",500,11545,4920,6630,"B - $10K to $20K"]
["Gadget","2019-09-10","Tue","Phare View Concepts","Consulting",500,11550,4920,6630,"B - $10K to $20K"]
["Gadget","2018-04-13","Fri","Surten Excel","Consulting",600,11593,5082,6516,"B - $10K to $20K"]
["Gadget","2018-04-13","Fri","Surten Excel","Consulting",600,11598,5082,6516,"B - $10K to $20K"]
["Widget","2018-01-16","Tue","SkyWire, Inc.","Utilities",600,11623,5082,6546,"B - $10K to $20K"]
["Widget","2018-01-16","Tue","SkyWire, Inc.","Utilities",600,11628,5082,6546,"B - $10K to $20K"]
["Gadget","2018-07-23","Mon","Phare View Concepts","Consulting",500,11655,4920,6740,"B - $10K to $20K"]
["Gadget","2018-07-23","Mon","Phare View Concepts","Consulting",500,11660,4920,6740,"B - $10K to $20K"]
["Gizmo","2019-12-27","Fri","St. Peter's Prep","Training",500,11675,5110,6570,"B - $10K to $20K"]
["Gizmo","2019-12-27","Fri","St. Peter's Prep","Training",500,11680,5110,6570,"B - $10K to $20K"]
["Gadget","2019-03-18","Mon","Orange County Health Department","Associations",500,11690,4920,6775,"B - $10K to $20K"]
["Gadget","2019-03-18","Mon","Orange County Health Department","Associations",500,11695,4920,6775,"B - $10K to $20K"]
["Widget","2018-05-24","Thu","Resource Optimizer","Utilities",600,11695,5082,6618,"B - $10K to $20K"]
["Widget","2018-05-24","Thu","Resource Optimizer","Utilities",600,11700,5082,6618,"B - $10K to $20K"]
["Gadget","2019-07-13","Sat","Steve Comer","Services",500,11720,4920,6805,"B - $10K to $20K"]
["Gadget","2019-07-13","Sat","Steve Comer","Services",500,11725,4920,6805,"B - $10K to $20K"]
["Gadget","2018-09-18","Tue","Phare View Concepts","Consulting",500,11840,4920,6925,"B - $10K to $20K"]
["Gadget","2018-09-18","Tue","Phare View Concepts","Consulting",500,11845,4920,6925,"B - $10K to $20K"]
["Widget","2019-03-26","Tue","Steve Comer","Services",700,11853,5929,5929,"B - $10K to $20K"]
["Gadget","2019-03-04","Mon","SpringBoard","Utilities",500,11855,4920,6940,"B - $10K to $20K"]
["Widget","2019-03-26","Tue","Steve Comer","Services",700,11858,5929,5929,"B - $10K to $20K"]
["Gadget","2019-03-04","Mon","SpringBoard","Utilities",500,11860,4920,6940,"B - $10K to $20K"]
["Widget","2019-02-27","Wed","Profology.com","Consulting",600,11917,5082,6840,"B - $10K to $20K"]
["Widget","2019-02-27","Wed","Profology.com","Consulting",600,11922,5082,6840,"B - $10K to $20K"]
["Widget","2018-12-14","Fri","SpringBoard","Utilities",600,11959,5082,6882,"B - $10K to $20K"]
["Gizmo","2019-03-14","Thu","St. Peter's Prep","Training",500,11960,5110,6855,"B - $10K to $20K"]
["Widget","2018-12-14","Fri","SpringBoard","Utilities",600,11964,5082,6882,"B - $10K to $20K"]
["Gizmo","2019-03-14","Thu","St. Peter's Prep","Training",500,11965,5110,6855,"B - $10K to $20K"]
["Gadget","2018-08-14","Tue","St. Peter's Prep","Training",600,12025,5904,6126,"B - $10K to $20K"]
["Gadget","2018-08-14","Tue","St. Peter's Prep","Training",600,12030,5904,6126,"B - $10K to $20K"]
["Gadget","2018-05-26","Sat","Resource Optimizer","Utilities",600,12043,5904,6144,"B - $10K to $20K"]
["Gadget","2018-05-26","Sat","Resource Optimizer","Utilities",600,12048,5904,6144,"B - $10K to $20K"]
["Gadget","2018-04-10","Tue","SkyWire, Inc.","Utilities",500,12090,4920,7175,"B - $10K to $20K"]
["Gadget","2018-04-10","Tue","SkyWire, Inc.","Utilities",500,12095,4920,7175,{"$f":"VLOOKUP(G579,$M$2:$N$6,2,TRUE)","v":"B - $10K to $20K"}]
["Widget","2019-10-23","Wed","Phare View Concepts","Consulting",700,12126,5929,6202,"B - $10K to $20K"]
["Gizmo","2018-06-08","Fri","SkyWire, Inc.","Utilities",500,12130,5110,7025,"B - $10K to $20K"]
["Widget","2019-10-23","Wed","Phare View Concepts","Consulting",700,12131,5929,6202,"B - $10K to $20K"]
["Gizmo","2018-06-08","Fri","SkyWire, Inc.","Utilities",500,12135,5110,7025,"B - $10K to $20K"]
["Widget","2019-02-26","Tue","Steve Comer","Services",700,12140,5929,6216,"B - $10K to $20K"]
["Widget","2019-02-26","Tue","Steve Comer","Services",700,12145,5929,6216,"B - $10K to $20K"]
["Gadget","2019-07-08","Mon","Resource Optimizer","Utilities",500,12265,4920,7350,"B - $10K to $20K"]
["Gadget","2019-07-08","Mon","Resource Optimizer","Utilities",500,12270,4920,7350,"B - $10K to $20K"]
["Gadget","2019-02-22","Fri","Profology.com","Consulting",600,12277,5904,6378,"B - $10K to $20K"]
["Gadget","2019-02-22","Fri","Profology.com","Consulting",600,12282,5904,6378,"B - $10K to $20K"]
["Widget","2018-05-07","Mon","SlinkyRN Excel Instruction and Consulting","Consulting",600,12313,5082,7236,"B - $10K to $20K"]
["Widget","2018-05-07","Mon","SlinkyRN Excel Instruction and Consulting","Consulting",600,12318,5082,7236,"B - $10K to $20K"]
["Widget","2018-09-15","Sat","Ribbon Commander Framework","Utilities",600,12325,5082,7248,"B - $10K to $20K"]
["Widget","2018-09-15","Sat","Ribbon Commander Framework","Utilities",600,12330,5082,7248,"B - $10K to $20K"]
["Widget","2019-04-27","Sat","Steve Comer","Services",600,12355,5082,7278,"B - $10K to $20K"]
["Widget","2019-04-27","Sat","Steve Comer","Services",600,12360,5082,7278,"B - $10K to $20K"]
["Gizmo","2019-06-30","Sun","Profology.com","Consulting",500,12420,5110,7315,"B - $10K to $20K"]
["Gizmo","2019-06-30","Sun","Profology.com","Consulting",500,12425,5110,7315,"B - $10K to $20K"]
["Widget","2018-03-06","Tue","Phare View Concepts","Consulting",700,12469,5929,6545,"B - $10K to $20K"]
["Widget","2018-03-06","Tue","Phare View Concepts","Consulting",700,12474,5929,6545,"B - $10K to $20K"]
["Gizmo","2018-09-29","Sat","St. Peter's Prep","Training",600,12475,6132,6348,"B - $10K to $20K"]
["Gizmo","2018-09-29","Sat","St. Peter's Prep","Training",600,12480,6132,6348,"B - $10K to $20K"]
["Gizmo","2019-03-09","Sat","Profology.com","Consulting",500,12500,5110,7395,"B - $10K to $20K"]
["Gizmo","2019-03-09","Sat","Profology.com","Consulting",500,12505,5110,7395,"B - $10K to $20K"]
["Gizmo","2019-05-30","Thu","SpringBoard","Utilities",500,12545,5110,7440,"B - $10K to $20K"]
["Gizmo","2019-05-30","Thu","SpringBoard","Utilities",500,12550,5110,7440,"B - $10K to $20K"]
["Gizmo","2019-08-25","Sun","Steve Comer","Services",600,12565,6132,6438,"B - $10K to $20K"]
["Gizmo","2019-08-25","Sun","Steve Comer","Services",600,12570,6132,6438,"B - $10K to $20K"]
["Gizmo","2019-08-30","Fri","SkyWire, Inc.","Utilities",500,12570,5110,7465,"B - $10K to $20K"]
["Gizmo","2019-08-30","Fri","SkyWire, Inc.","Utilities",500,12575,5110,7465,"B - $10K to $20K"]
["Widget","2018-01-24","Wed","Steve Comer","Services",600,12601,5082,7524,"B - $10K to $20K"]
["Widget","2018-01-24","Wed","Steve Comer","Services",600,12606,5082,7524,"B - $10K to $20K"]
["Gizmo","2019-11-04","Mon","Resource Optimizer","Utilities",600,12607,6132,6480,"B - $10K to $20K"]
["Gizmo","2019-11-04","Mon","Resource Optimizer","Utilities",600,12612,6132,6480,"B - $10K to $20K"]
["Gizmo","2018-05-13","Sun","Ribbon Commander Framework","Utilities",500,12620,5110,7515,"B - $10K to $20K"]
["Gizmo","2018-05-13","Sun","Ribbon Commander Framework","Utilities",500,12625,5110,7515,"B - $10K to $20K"]
["Gadget","2019-02-01","Fri","Serving Brevard Realty","Services",600,12667,5904,6768,"B - $10K to $20K"]
["Gadget","2019-02-01","Fri","Serving Brevard Realty","Services",600,12672,5904,6768,"B - $10K to $20K"]
["Widget","2018-07-20","Fri","Tennessee Moon","Retail",600,12679,5082,7602,"B - $10K to $20K"]
["Widget","2018-07-20","Fri","Tennessee Moon","Retail",600,12684,5082,7602,"B - $10K to $20K"]
["Gadget","2019-09-25","Wed","SkyWire, Inc.","Utilities",600,12685,5904,6786,"B - $10K to $20K"]
["Gadget","2019-09-25","Wed","SkyWire, Inc.","Utilities",600,12690,5904,6786,"B - $10K to $20K"]
["Gizmo","2019-08-19","Mon","Serving Brevard Realty","Services",500,12750,5110,7645,"B - $10K to $20K"]
["Gadget","2018-09-10","Mon","Steve Comer","Services",600,12751,5904,6852,"B - $10K to $20K"]
["Gizmo","2019-08-19","Mon","Serving Brevard Realty","Services",500,12755,5110,7645,"B - $10K to $20K"]
["Gizmo","2019-10-03","Thu","Reports Wand","Applications",500,12755,5110,7650,"B - $10K to $20K"]
["Gadget","2018-09-10","Mon","Steve Comer","Services",600,12756,5904,6852,"B - $10K to $20K"]
["Gizmo","2019-10-03","Thu","Reports Wand","Applications",500,12760,5110,7650,"B - $10K to $20K"]
["Gadget","2019-02-13","Wed","Reports Wand","Applications",600,12793,5904,6894,"B - $10K to $20K"]
["Gadget","2019-02-13","Wed","Reports Wand","Applications",600,12798,5904,6894,"B - $10K to $20K"]
["Widget","2018-05-23","Wed","Orange County Health Department","Associations",700,12798,5929,6874,"B - $10K to $20K"]
["Widget","2018-05-23","Wed","Orange County Health Department","Associations",700,12803,5929,6874,"B - $10K to $20K"]
["Gadget","2018-06-14","Thu","SpringBoard","Utilities",700,12833,5929,6909,"B - $10K to $20K"]
["Gadget","2018-06-14","Thu","SpringBoard","Utilities",700,12838,5929,6909,"B - $10K to $20K"]
["Gadget","2018-12-10","Mon","Reports Wand","Applications",600,12883,5904,6984,"B - $10K to $20K"]
["Gadget","2018-12-10","Mon","Reports Wand","Applications",600,12888,5904,6984,"B - $10K to $20K"]
["Gizmo","2019-09-10","Tue","Steve Comer","Services",600,12931,6132,6804,"B - $10K to $20K"]
["Gizmo","2019-09-10","Tue","Steve Comer","Services",600,12936,6132,6804,"B - $10K to $20K"]
["Gizmo","2018-07-30","Mon","Ribbon Commander Framework","Utilities",600,12979,6132,6852,"B - $10K to $20K"]
["Gizmo","2018-07-30","Mon","Ribbon Commander Framework","Utilities",600,12984,6132,6852,"B - $10K to $20K"]
["Widget","2019-09-28","Sat","SlinkyRN Excel Instruction and Consulting","Consulting",700,13134,5929,7210,"B - $10K to $20K"]
["Widget","2019-09-28","Sat","SlinkyRN Excel Instruction and Consulting","Consulting",700,13139,5929,7210,"B - $10K to $20K"]
["Widget","2019-10-07","Mon","Phare View Concepts","Consulting",700,13190,5929,7266,"B - $10K to $20K"]
["Widget","2019-10-07","Mon","Phare View Concepts","Consulting",700,13195,5929,7266,{"$f":"VLOOKUP(G643,$M$2:$N$6,2,TRUE)","v":"B - $10K to $20K"}]
["Gadget","2018-11-17","Sat","Phare View Concepts","Consulting",600,13195,5904,7296,"B - $10K to $20K"]
["Gadget","2018-11-17","Sat","Phare View Concepts","Consulting",600,13200,5904,7296,"B - $10K to $20K"]
["Gadget","2018-02-26","Mon","SpringBoard","Utilities",600,13201,5904,7302,"B - $10K to $20K"]
["Gadget","2018-02-26","Mon","SpringBoard","Utilities",600,13206,5904,7302,"B - $10K to $20K"]
["Gizmo","2019-12-02","Mon","Orange County Health Department","Associations",600,13285,6132,7158,"B - $10K to $20K"]
["Gizmo","2019-12-02","Mon","Orange County Health Department","Associations",600,13290,6132,7158,"B - $10K to $20K"]
["Widget","2019-02-05","Tue","Orange County Health Department","Associations",700,13309,5929,7385,"B - $10K to $20K"]
["Widget","2019-02-05","Tue","Orange County Health Department","Associations",700,13314,5929,7385,"B - $10K to $20K"]
["Gadget","2019-07-26","Fri","St. Peter's Prep","Training",600,13327,5904,7428,"B - $10K to $20K"]
["Gadget","2019-07-26","Fri","St. Peter's Prep","Training",600,13332,5904,7428,"B - $10K to $20K"]
["Gadget","2019-08-11","Sun","SkyWire, Inc.","Utilities",600,13363,5904,7464,"B - $10K to $20K"]
["Gadget","2019-08-11","Sun","SkyWire, Inc.","Utilities",600,13368,5904,7464,"B - $10K to $20K"]
["Widget","2018-05-30","Wed","Serving Brevard Realty","Services",700,13407,5929,7483,"B - $10K to $20K"]
["Widget","2018-05-30","Wed","Serving Brevard Realty","Services",700,13412,5929,7483,"B - $10K to $20K"]
["Widget","2018-08-05","Sun","Tennessee Moon","Retail",700,13428,5929,7504,"B - $10K to $20K"]
["Widget","2018-08-05","Sun","Tennessee Moon","Retail",700,13433,5929,7504,"B - $10K to $20K"]
["Gizmo","2019-03-31","Sun","Profology.com","Consulting",600,13537,6132,7410,"B - $10K to $20K"]
["Gizmo","2019-03-31","Sun","Profology.com","Consulting",600,13542,6132,7410,"B - $10K to $20K"]
["Widget","2018-09-28","Fri","Roto-Rooter","Services",800,13547,6776,6776,"B - $10K to $20K"]
["Widget","2019-12-18","Wed","Surten Excel","Consulting",700,13547,5929,7623,"B - $10K to $20K"]
["Widget","2018-09-28","Fri","Roto-Rooter","Services",800,13552,6776,6776,"B - $10K to $20K"]
["Widget","2019-12-18","Wed","Surten Excel","Consulting",700,13552,5929,7623,"B - $10K to $20K"]
["Gadget","2019-09-14","Sat","Ribbon Commander Framework","Utilities",600,13561,5904,7662,"B - $10K to $20K"]
["Gadget","2019-09-14","Sat","Ribbon Commander Framework","Utilities",600,13566,5904,7662,"B - $10K to $20K"]
["Gizmo","2019-11-17","Sun","Roto-Rooter","Services",600,13675,6132,7548,"B - $10K to $20K"]
["Gizmo","2019-11-17","Sun","Roto-Rooter","Services",600,13680,6132,7548,"B - $10K to $20K"]
["Gadget","2018-09-26","Wed","Surten Excel","Consulting",600,13723,5904,7824,"B - $10K to $20K"]
["Gadget","2018-09-26","Wed","Surten Excel","Consulting",600,13728,5904,7824,"B - $10K to $20K"]
["Widget","2018-06-26","Tue","Ribbon Commander Framework","Utilities",700,13729,5929,7805,"B - $10K to $20K"]
["Widget","2018-06-26","Tue","Ribbon Commander Framework","Utilities",700,13734,5929,7805,"B - $10K to $20K"]
["Gadget","2019-10-22","Tue","SpringBoard","Utilities",700,13792,6888,6909,"B - $10K to $20K"]
["Gadget","2019-10-22","Tue","SpringBoard","Utilities",700,13797,6888,6909,"B - $10K to $20K"]
["Widget","2019-07-18","Thu","Phare View Concepts","Consulting",700,13799,5929,7875,"B - $10K to $20K"]
["Gizmo","2019-01-07","Mon","Safety Elements Ltd.","Services",600,13801,6132,7674,"B - $10K to $20K"]
["Widget","2019-07-18","Thu","Phare View Concepts","Consulting",700,13804,5929,7875,"B - $10K to $20K"]
["Gizmo","2019-01-07","Mon","Safety Elements Ltd.","Services",600,13806,6132,7674,"B - $10K to $20K"]
["Gizmo","2019-10-31","Thu","St. Peter's Prep","Training",600,13813,6132,7686,"B - $10K to $20K"]
["Gizmo","2019-10-31","Thu","St. Peter's Prep","Training",600,13818,6132,7686,"B - $10K to $20K"]
["Widget","2019-05-22","Wed","Profology.com","Consulting",700,13848,5929,7924,"B - $10K to $20K"]
["Widget","2019-05-22","Wed","Profology.com","Consulting",700,13853,5929,7924,"B - $10K to $20K"]
["Gadget","2018-07-28","Sat","Reports Wand","Applications",600,13861,5904,7962,"B - $10K to $20K"]
["Gadget","2018-02-14","Wed","Resource Optimizer","Utilities",700,13862,6888,6979,"B - $10K to $20K"]
["Gadget","2018-07-28","Sat","Reports Wand","Applications",600,13866,5904,7962,"B - $10K to $20K"]
["Gadget","2018-02-14","Wed","Resource Optimizer","Utilities",700,13867,6888,6979,"B - $10K to $20K"]
["Gadget","2019-06-18","Tue","Roto-Rooter","Services",700,13869,5929,7945,"B - $10K to $20K"]
["Gadget","2019-06-18","Tue","Roto-Rooter","Services",700,13874,5929,7945,"B - $10K to $20K"]
["Widget","2018-07-29","Sun","Surten Excel","Consulting",800,13931,6776,7160,"B - $10K to $20K"]
["Widget","2018-07-29","Sun","Surten Excel","Consulting",800,13936,6776,7160,"B - $10K to $20K"]
["Gizmo","2018-08-04","Sat","Roto-Rooter","Services",600,13957,6132,7830,"B - $10K to $20K"]
["Gizmo","2018-08-04","Sat","Roto-Rooter","Services",600,13962,6132,7830,"B - $10K to $20K"]
["Widget","2018-06-01","Fri","Orange County Health Department","Associations",700,13981,5929,8057,"B - $10K to $20K"]
["Widget","2018-06-01","Fri","Orange County Health Department","Associations",700,13986,5929,8057,"B - $10K to $20K"]
["Gadget","2019-04-14","Sun","Roto-Rooter","Services",600,13999,5904,8100,"B - $10K to $20K"]
["Gadget","2019-09-27","Fri","Orange County Health Department","Associations",600,13999,5904,8100,"B - $10K to $20K"]
["Gadget","2019-04-14","Sun","Roto-Rooter","Services",600,14004,5904,8100,"B - $10K to $20K"]
["Gadget","2019-09-27","Fri","Orange County Health Department","Associations",600,14004,5904,8100,"B - $10K to $20K"]
["Widget","2018-12-08","Sat","Ribbon Commander Framework","Utilities",700,14100,5929,8176,"B - $10K to $20K"]
["Widget","2018-12-08","Sat","Ribbon Commander Framework","Utilities",700,14105,5929,8176,"B - $10K to $20K"]
["Widget","2018-10-16","Tue","Reports Wand","Applications",700,14128,5929,8204,"B - $10K to $20K"]
["Widget","2018-10-20","Sat","Reports Wand","Applications",800,14131,6776,7360,"B - $10K to $20K"]
["Widget","2018-10-16","Tue","Reports Wand","Applications",700,14133,5929,8204,"B - $10K to $20K"]
["Widget","2018-10-20","Sat","Reports Wand","Applications",800,14136,6776,7360,"B - $10K to $20K"]
["Gadget","2019-11-29","Fri","Ribbon Commander Framework","Utilities",600,14149,5904,8250,"B - $10K to $20K"]
["Gadget","2019-11-29","Fri","Ribbon Commander Framework","Utilities",600,14154,5904,8250,{"$f":"VLOOKUP(G707,$M$2:$N$6,2,TRUE)","v":"B - $10K to $20K"}]
["Gizmo","2018-12-27","Thu","SlinkyRN Excel Instruction and Consulting","Consulting",600,14173,6132,8046,"B - $10K to $20K"]
["Gizmo","2018-12-27","Thu","SlinkyRN Excel Instruction and Consulting","Consulting",600,14178,6132,8046,"B - $10K to $20K"]
["Gadget","2019-05-20","Mon","Steve Comer","Services",700,14198,6888,7315,"B - $10K to $20K"]
["Gadget","2019-05-20","Mon","Steve Comer","Services",700,14203,6888,7315,"B - $10K to $20K"]
["Widget","2019-04-15","Mon","St. Peter's Prep","Training",800,14211,6776,7440,"B - $10K to $20K"]
["Widget","2019-04-15","Mon","St. Peter's Prep","Training",800,14216,6776,7440,"B - $10K to $20K"]
["Widget","2019-01-29","Tue","Roto-Rooter","Services",800,14219,6776,7448,"B - $10K to $20K"]
["Widget","2019-01-29","Tue","Roto-Rooter","Services",800,14224,6776,7448,"B - $10K to $20K"]
["Widget","2018-12-20","Thu","Ribbon Commander Framework","Utilities",800,14403,6776,7632,"B - $10K to $20K"]
["Widget","2018-12-20","Thu","Ribbon Commander Framework","Utilities",800,14408,6776,7632,"B - $10K to $20K"]
["Doodads","2018-01-21","Sun","Profology.com","Consulting",800,14435,6776,7664,"B - $10K to $20K"]
["Doodads","2018-01-21","Sun","Profology.com","Consulting",800,14440,6776,7664,"B - $10K to $20K"]
["Gizmo","2018-04-01","Sun","St. Peter's Prep","Training",600,14443,6132,8316,"B - $10K to $20K"]
["Gizmo","2018-04-01","Sun","St. Peter's Prep","Training",600,14448,6132,8316,"B - $10K to $20K"]
["Gadget","2018-11-13","Tue","Profology.com","Consulting",600,14461,5904,8562,"B - $10K to $20K"]
["Gizmo","2018-05-28","Mon","Safety Elements Ltd.","Services",700,14464,7154,7315,"B - $10K to $20K"]
["Gadget","2018-11-13","Tue","Profology.com","Consulting",600,14466,5904,8562,"B - $10K to $20K"]
["Gadget","2018-03-04","Sun","Profology.com","Consulting",600,14467,5904,8568,"B - $10K to $20K"]
["Gizmo","2018-05-28","Mon","Safety Elements Ltd.","Services",700,14469,7154,7315,"B - $10K to $20K"]
["Gadget","2018-03-04","Sun","Profology.com","Consulting",600,14472,5904,8568,"B - $10K to $20K"]
["Gadget","2019-07-15","Mon","Safety Elements Ltd.","Services",700,14492,6888,7609,"B - $10K to $20K"]
["Gadget","2019-07-15","Mon","Safety Elements Ltd.","Services",700,14497,6888,7609,"B - $10K to $20K"]
["Gadget","2019-12-27","Fri","SkyWire, Inc.","Utilities",700,14555,6888,7672,"B - $10K to $20K"]
["Gadget","2019-12-27","Fri","SkyWire, Inc.","Utilities",700,14560,6888,7672,"B - $10K to $20K"]
["Gadget","2019-09-12","Thu","Resource Optimizer","Utilities",600,14575,5904,8676,"B - $10K to $20K"]
["Gadget","2019-09-12","Thu","Resource Optimizer","Utilities",600,14580,5904,8676,"B - $10K to $20K"]
["Widget","2018-01-23","Tue","St. Peter's Prep","Training",800,14587,6776,7816,"B - $10K to $20K"]
["Widget","2018-01-23","Tue","St. Peter's Prep","Training",800,14592,6776,7816,"B - $10K to $20K"]
["Gizmo","2019-05-21","Tue","Surten Excel","Consulting",600,14629,6132,8502,"B - $10K to $20K"]
["Gizmo","2019-05-21","Tue","Surten Excel","Consulting",600,14634,6132,8502,"B - $10K to $20K"]
["Widget","2018-04-07","Sat","SpringBoard","Utilities",700,14681,5929,8757,"B - $10K to $20K"]
["Widget","2018-04-07","Sat","SpringBoard","Utilities",700,14686,5929,8757,"B - $10K to $20K"]
["Gadget","2019-11-13","Wed","Phare View Concepts","Consulting",700,14779,6888,7896,"B - $10K to $20K"]
["Gadget","2019-11-13","Wed","Phare View Concepts","Consulting",700,14784,6888,7896,"B - $10K to $20K"]
["Widget","2019-03-06","Wed","SkyWire, Inc.","Utilities",800,14979,6776,8208,"B - $10K to $20K"]
["Widget","2019-03-06","Wed","SkyWire, Inc.","Utilities",800,14984,6776,8208,"B - $10K to $20K"]
["Gizmo","2018-08-22","Wed","Roto-Rooter","Services",600,15001,6132,8874,"B - $10K to $20K"]
["Gizmo","2018-08-22","Wed","Roto-Rooter","Services",600,15006,6132,8874,"B - $10K to $20K"]
["Widget","2019-11-05","Tue","Orange County Health Department","Associations",800,15099,6776,8328,"B - $10K to $20K"]
["Widget","2019-11-05","Tue","Orange County Health Department","Associations",800,15104,6776,8328,"B - $10K to $20K"]
["Gizmo","2019-12-28","Sat","Resource Optimizer","Utilities",700,15220,7154,8071,"B - $10K to $20K"]
["Gizmo","2019-12-28","Sat","Resource Optimizer","Utilities",700,15225,7154,8071,"B - $10K to $20K"]
["Widget","2018-11-15","Thu","Profology.com","Consulting",900,15250,7623,7632,"B - $10K to $20K"]
["Widget","2018-11-15","Thu","Profology.com","Consulting",900,15255,7623,7632,"B - $10K to $20K"]
["Widget","2018-08-06","Mon","Roto-Rooter","Services",800,15283,6776,8512,"B - $10K to $20K"]
["Widget","2018-08-06","Mon","Roto-Rooter","Services",800,15288,6776,8512,"B - $10K to $20K"]
["Widget","2019-10-17","Thu","Orange County Health Department","Associations",800,15307,6776,8536,"B - $10K to $20K"]
["Widget","2019-10-17","Thu","Orange County Health Department","Associations",800,15312,6776,8536,"B - $10K to $20K"]
["Widget","2019-12-29","Sun","Ribbon Commander Framework","Utilities",900,15358,7623,7740,"B - $10K to $20K"]
["Widget","2019-12-29","Sun","Ribbon Commander Framework","Utilities",900,15363,7623,7740,"B - $10K to $20K"]
["Gadget","2019-06-26","Wed","SkyWire, Inc.","Utilities",800,15395,6776,8624,"B - $10K to $20K"]
["Gadget","2019-06-26","Wed","SkyWire, Inc.","Utilities",800,15400,6776,8624,"B - $10K to $20K"]
["Gadget","2019-05-05","Sun","Resource Optimizer","Utilities",700,15402,6888,8519,"B - $10K to $20K"]
["Gadget","2019-05-05","Sun","Resource Optimizer","Utilities",700,15407,6888,8519,"B - $10K to $20K"]
["Gizmo","2019-04-04","Thu","Orange County Health Department","Associations",700,15430,7154,8281,"B - $10K to $20K"]
["Gizmo","2019-04-04","Thu","Orange County Health Department","Associations",700,15435,7154,8281,"B - $10K to $20K"]
["Widget","2019-08-04","Sun","Tennessee Moon","Retail",800,15483,6776,8712,"B - $10K to $20K"]
["Widget","2019-08-04","Sun","Tennessee Moon","Retail",800,15488,6776,8712,"B - $10K to $20K"]
["Gadget","2019-08-22","Thu","Surten Excel","Consulting",800,15539,6776,8768,"B - $10K to $20K"]
["Gadget","2019-08-22","Thu","Surten Excel","Consulting",800,15544,6776,8768,"B - $10K to $20K"]
["Widget","2018-05-05","Sat","Orange County Health Department","Associations",800,15587,6776,8816,"B - $10K to $20K"]
["Widget","2018-05-05","Sat","Orange County Health Department","Associations",800,15592,6776,8816,"B - $10K to $20K"]
["Widget","2018-01-31","Wed","Reports Wand","Applications",800,15635,6776,8864,"B - $10K to $20K"]
["Widget","2018-01-31","Wed","Reports Wand","Applications",800,15640,6776,8864,{"$f":"VLOOKUP(G771,$M$2:$N$6,2,TRUE)","v":"B - $10K to $20K"}]
["Widget","2018-12-18","Tue","Resource Optimizer","Utilities",900,15646,7623,8028,"B - $10K to $20K"]
["Widget","2018-12-18","Tue","Resource Optimizer","Utilities",900,15651,7623,8028,"B - $10K to $20K"]
["Gadget","2018-09-10","Mon","Serving Brevard Realty","Services",700,15675,6888,8792,"B - $10K to $20K"]
["Gadget","2018-09-10","Mon","Serving Brevard Realty","Services",700,15680,6888,8792,"B - $10K to $20K"]
["Gizmo","2018-10-07","Sun","Safety Elements Ltd.","Services",700,15710,7154,8561,"B - $10K to $20K"]
["Gizmo","2018-10-07","Sun","Safety Elements Ltd.","Services",700,15715,7154,8561,"B - $10K to $20K"]
["Widget","2018-09-30","Sun","SkyWire, Inc.","Utilities",900,15754,7623,8136,"B - $10K to $20K"]
["Widget","2018-09-30","Sun","SkyWire, Inc.","Utilities",900,15759,7623,8136,"B - $10K to $20K"]
["Gadget","2018-07-26","Thu","Roto-Rooter","Services",800,15811,7872,7944,"B - $10K to $20K"]
["Gadget","2018-07-26","Thu","Roto-Rooter","Services",800,15816,7872,7944,"B - $10K to $20K"]
["Gizmo","2018-04-22","Sun","Orange County Health Department","Associations",700,15829,7154,8680,"B - $10K to $20K"]
["Gizmo","2018-04-22","Sun","Orange County Health Department","Associations",700,15834,7154,8680,"B - $10K to $20K"]
["Gadget","2018-06-26","Tue","Steve Comer","Services",800,15851,7872,7984,"B - $10K to $20K"]
["Gadget","2019-03-23","Sat","Serving Brevard Realty","Services",800,15851,7872,7984,"B - $10K to $20K"]
["Gadget","2018-06-26","Tue","Steve Comer","Services",800,15856,7872,7984,"B - $10K to $20K"]
["Gadget","2019-03-23","Sat","Serving Brevard Realty","Services",800,15856,7872,7984,"B - $10K to $20K"]
["Gizmo","2018-07-15","Sun","Surten Excel","Consulting",700,15871,7154,8722,"B - $10K to $20K"]
["Gizmo","2018-07-15","Sun","Surten Excel","Consulting",700,15876,7154,8722,"B - $10K to $20K"]
["Widget","2018-10-27","Sat","Reports Wand","Applications",800,15971,6776,9200,"B - $10K to $20K"]
["Widget","2018-10-27","Sat","Reports Wand","Applications",800,15976,6776,9200,"B - $10K to $20K"]
["Gizmo","2019-06-21","Fri","Safety Elements Ltd.","Services",700,15983,7154,8834,"B - $10K to $20K"]
["Gizmo","2019-06-21","Fri","Safety Elements Ltd.","Services",700,15988,7154,8834,"B - $10K to $20K"]
["Widget","2018-10-22","Mon","SlinkyRN Excel Instruction and Consulting","Consulting",800,16003,6776,9232,"B - $10K to $20K"]
["Widget","2018-10-22","Mon","SlinkyRN Excel Instruction and Consulting","Consulting",800,16008,6776,9232,"B - $10K to $20K"]
["Gadget","2018-03-30","Fri","SlinkyRN Excel Instruction and Consulting","Consulting",800,16011,7872,8144,"B - $10K to $20K"]
["Gadget","2018-03-30","Fri","SlinkyRN Excel Instruction and Consulting","Consulting",800,16016,7872,8144,"B - $10K to $20K"]
["Widget","2019-09-01","Sun","Orange County Health Department","Associations",800,16139,6776,9368,"B - $10K to $20K"]
["Widget","2019-09-01","Sun","Orange County Health Department","Associations",800,16144,6776,9368,"B - $10K to $20K"]
["Gadget","2019-07-29","Mon","Safety Elements Ltd.","Services",700,16165,6888,9282,"B - $10K to $20K"]
["Gadget","2019-07-29","Mon","Safety Elements Ltd.","Services",700,16170,6888,9282,"B - $10K to $20K"]
["Widget","2018-02-27","Tue","Safety Elements Ltd.","Services",900,16204,7623,8586,"B - $10K to $20K"]
["Widget","2018-02-27","Tue","Safety Elements Ltd.","Services",900,16209,7623,8586,"B - $10K to $20K"]
["Gadget","2019-06-26","Wed","Phare View Concepts","Consulting",700,16214,6888,9331,"B - $10K to $20K"]
["Gadget","2019-06-26","Wed","Phare View Concepts","Consulting",700,16219,6888,9331,"B - $10K to $20K"]
["Gadget","2019-08-18","Sun","Orange County Health Department","Associations",800,16227,7872,8360,"B - $10K to $20K"]
["Gadget","2019-08-18","Sun","Orange County Health Department","Associations",800,16232,7872,8360,"B - $10K to $20K"]
["Gadget","2019-05-28","Tue","Roto-Rooter","Services",800,16259,7872,8392,"B - $10K to $20K"]
["Gadget","2019-05-28","Tue","Roto-Rooter","Services",800,16264,7872,8392,"B - $10K to $20K"]
["Widget","2019-06-09","Sun","Safety Elements Ltd.","Services",800,16283,6776,9512,"B - $10K to $20K"]
["Widget","2019-06-09","Sun","Safety Elements Ltd.","Services",800,16288,6776,9512,"B - $10K to $20K"]
["Gadget","2019-07-05","Fri","St. Peter's Prep","Training",700,16298,6888,9415,"B - $10K to $20K"]
["Gadget","2019-07-05","Fri","St. Peter's Prep","Training",700,16303,6888,9415,"B - $10K to $20K"]
["Gadget","2019-05-30","Thu","SlinkyRN Excel Instruction and Consulting","Consulting",700,16403,6888,9520,"B - $10K to $20K"]
["Gadget","2019-05-30","Thu","SlinkyRN Excel Instruction and Consulting","Consulting",700,16408,6888,9520,"B - $10K to $20K"]
["Widget","2018-01-09","Tue","Ribbon Commander Framework","Utilities",800,16411,6776,9640,"B - $10K to $20K"]
["Widget","2018-01-09","Tue","Ribbon Commander Framework","Utilities",800,16416,6776,9640,"B - $10K to $20K"]
["Gizmo","2019-11-08","Fri","Safety Elements Ltd.","Services",700,16571,7154,9422,"B - $10K to $20K"]
["Gizmo","2019-11-08","Fri","Safety Elements Ltd.","Services",700,16576,7154,9422,"B - $10K to $20K"]
["Widget","2018-03-19","Mon","Safety Elements Ltd.","Services",800,16691,6776,9920,"B - $10K to $20K"]
["Widget","2018-03-19","Mon","Safety Elements Ltd.","Services",800,16696,6776,9920,"B - $10K to $20K"]
["Gadget","2018-05-09","Wed","Resource Optimizer","Utilities",700,16760,6888,9877,"B - $10K to $20K"]
["Gadget","2018-05-09","Wed","Resource Optimizer","Utilities",700,16765,6888,9877,"B - $10K to $20K"]
["Gadget","2018-05-12","Sat","Resource Optimizer","Utilities",700,16767,6888,9884,"B - $10K to $20K"]
["Gadget","2018-05-12","Sat","Resource Optimizer","Utilities",700,16772,6888,9884,"B - $10K to $20K"]
["Gadget","2018-09-19","Wed","Roto-Rooter","Services",800,16779,7872,8912,"B - $10K to $20K"]
["Gadget","2018-09-19","Wed","Roto-Rooter","Services",800,16784,7872,8912,"B - $10K to $20K"]
["Widget","2018-12-06","Thu","Surten Excel","Consulting",800,16851,6776,10080,"B - $10K to $20K"]
["Widget","2018-12-06","Thu","Surten Excel","Consulting",800,16856,6776,10080,"B - $10K to $20K"]
["Gizmo","2018-02-16","Fri","SpringBoard","Utilities",800,16931,8176,8760,"B - $10K to $20K"]
["Gadget","2018-08-12","Sun","Safety Elements Ltd.","Services",800,16931,7872,9064,"B - $10K to $20K"]
["Gizmo","2018-10-06","Sat","Phare View Concepts","Consulting",800,16931,8176,8760,"B - $10K to $20K"]
["Gizmo","2018-02-16","Fri","SpringBoard","Utilities",800,16936,8176,8760,"B - $10K to $20K"]
["Gadget","2018-08-12","Sun","Safety Elements Ltd.","Services",800,16936,7872,9064,"B - $10K to $20K"]
["Gizmo","2018-10-06","Sat","Phare View Concepts","Consulting",800,16936,8176,8760,{"$f":"VLOOKUP(G835,$M$2:$N$6,2,TRUE)","v":"B - $10K to $20K"}]
["Gadget","2019-05-31","Fri","SpringBoard","Utilities",800,17051,7872,9184,"B - $10K to $20K"]
["Gizmo","2019-11-09","Sat","SlinkyRN Excel Instruction and Consulting","Consulting",700,17054,7154,9905,"B - $10K to $20K"]
["Gadget","2019-05-31","Fri","SpringBoard","Utilities",800,17056,7872,9184,"B - $10K to $20K"]
["Gizmo","2019-11-09","Sat","SlinkyRN Excel Instruction and Consulting","Consulting",700,17059,7154,9905,"B - $10K to $20K"]
["Widget","2018-11-23","Fri","St. Peter's Prep","Training",900,17131,7623,9513,"B - $10K to $20K"]
["Gadget","2019-11-19","Tue","Roto-Rooter","Services",800,17131,7872,9264,"B - $10K to $20K"]
["Widget","2018-11-23","Fri","St. Peter's Prep","Training",900,17136,7623,9513,"B - $10K to $20K"]
["Gadget","2019-11-19","Tue","Roto-Rooter","Services",800,17136,7872,9264,"B - $10K to $20K"]
["Gadget","2018-01-29","Mon","Orange County Health Department","Associations",700,17145,6888,10262,"B - $10K to $20K"]
["Gadget","2018-01-29","Mon","Orange County Health Department","Associations",700,17150,6888,10262,"B - $10K to $20K"]
["Gadget","2018-02-03","Sat","Ribbon Commander Framework","Utilities",800,17155,7872,9288,"B - $10K to $20K"]
["Gizmo","2019-08-28","Wed","Resource Optimizer","Utilities",800,17155,8176,8984,"B - $10K to $20K"]
["Gadget","2018-02-03","Sat","Ribbon Commander Framework","Utilities",800,17160,7872,9288,"B - $10K to $20K"]
["Gizmo","2019-08-28","Wed","Resource Optimizer","Utilities",800,17160,8176,8984,"B - $10K to $20K"]
["Widget","2019-04-20","Sat","Serving Brevard Realty","Services",900,17167,7623,9549,"B - $10K to $20K"]
["Widget","2019-04-20","Sat","Serving Brevard Realty","Services",900,17172,7623,9549,"B - $10K to $20K"]
["Widget","2019-10-14","Mon","Steve Comer","Services",1000,17185,8470,8720,"B - $10K to $20K"]
["Widget","2019-10-14","Mon","Steve Comer","Services",1000,17190,8470,8720,"B - $10K to $20K"]
["Gizmo","2019-12-23","Mon","St. Peter's Prep","Training",700,17194,7154,10045,"B - $10K to $20K"]
["Widget","2018-09-22","Sat","SpringBoard","Utilities",1000,17195,8470,8730,"B - $10K to $20K"]
["Gizmo","2019-12-23","Mon","St. Peter's Prep","Training",700,17199,7154,10045,"B - $10K to $20K"]
["Widget","2018-09-22","Sat","SpringBoard","Utilities",1000,17200,8470,8730,"B - $10K to $20K"]
["Gadget","2019-08-16","Fri","Profology.com","Consulting",700,17208,6888,10325,"B - $10K to $20K"]
["Gadget","2019-08-16","Fri","Profology.com","Consulting",700,17213,6888,10325,"B - $10K to $20K"]
["Gadget","2019-03-30","Sat","St. Peter's Prep","Training",800,17235,7872,9368,"B - $10K to $20K"]
["Gadget","2019-03-30","Sat","St. Peter's Prep","Training",800,17240,7872,9368,"B - $10K to $20K"]
["Widget","2018-11-16","Fri","Surten Excel","Consulting",1000,17245,8470,8780,"B - $10K to $20K"]
["Widget","2018-11-16","Fri","Surten Excel","Consulting",1000,17250,8470,8780,"B - $10K to $20K"]
["Widget","2019-09-05","Thu","Roto-Rooter","Services",900,17284,7623,9666,"B - $10K to $20K"]
["Widget","2019-09-05","Thu","Roto-Rooter","Services",900,17289,7623,9666,"B - $10K to $20K"]
["Gizmo","2019-02-26","Tue","SlinkyRN Excel Instruction and Consulting","Consulting",700,17362,7154,10213,"B - $10K to $20K"]
["Gizmo","2019-02-26","Tue","SlinkyRN Excel Instruction and Consulting","Consulting",700,17367,7154,10213,"B - $10K to $20K"]
["Widget","2019-12-10","Tue","Resource Optimizer","Utilities",1000,17405,8470,8940,"B - $10K to $20K"]
["Widget","2019-12-10","Tue","Resource Optimizer","Utilities",1000,17410,8470,8940,"B - $10K to $20K"]
["Gadget","2019-07-16","Tue","Profology.com","Consulting",800,17411,7872,9544,"B - $10K to $20K"]
["Gadget","2019-07-16","Tue","Profology.com","Consulting",800,17416,7872,9544,"B - $10K to $20K"]
["Gizmo","2019-12-05","Thu","Serving Brevard Realty","Services",800,17491,8176,9320,"B - $10K to $20K"]
["Gizmo","2019-12-05","Thu","Serving Brevard Realty","Services",800,17496,8176,9320,"B - $10K to $20K"]
["Widget","2019-01-20","Sun","Roto-Rooter","Services",900,17500,7623,9882,"B - $10K to $20K"]
["Widget","2019-01-20","Sun","Roto-Rooter","Services",900,17505,7623,9882,"B - $10K to $20K"]
["Gadget","2018-05-08","Tue","Roto-Rooter","Services",800,17539,7872,9672,"B - $10K to $20K"]
["Gadget","2018-05-08","Tue","Roto-Rooter","Services",800,17544,7872,9672,"B - $10K to $20K"]
["Gadget","2018-09-27","Thu","Tennessee Moon","Retail",900,17707,7623,10089,"B - $10K to $20K"]
["Gadget","2018-09-27","Thu","Tennessee Moon","Retail",900,17712,7623,10089,"B - $10K to $20K"]
["Gizmo","2019-04-24","Wed","Roto-Rooter","Services",800,17723,8176,9552,"B - $10K to $20K"]
["Gizmo","2019-04-24","Wed","Roto-Rooter","Services",800,17728,8176,9552,"B - $10K to $20K"]
["Gadget","2018-05-19","Sat","Roto-Rooter","Services",900,17752,8856,8901,"B - $10K to $20K"]
["Gadget","2018-05-19","Sat","Roto-Rooter","Services",900,17757,8856,8901,"B - $10K to $20K"]
["Widget","2018-07-29","Sun","Roto-Rooter","Services",1000,17835,8470,9370,"B - $10K to $20K"]
["Widget","2018-07-29","Sun","Roto-Rooter","Services",1000,17840,8470,9370,"B - $10K to $20K"]
["Doodads","2018-08-25","Sat","Ribbon Commander Framework","Utilities",800,17851,8176,9680,"B - $10K to $20K"]
["Doodads","2018-08-25","Sat","Ribbon Commander Framework","Utilities",800,17856,8176,9680,"B - $10K to $20K"]
["Widget","2019-07-11","Thu","SkyWire, Inc.","Utilities",900,17878,7623,10260,"B - $10K to $20K"]
["Widget","2019-07-11","Thu","SkyWire, Inc.","Utilities",900,17883,7623,10260,"B - $10K to $20K"]
["Gadget","2019-06-11","Tue","Serving Brevard Realty","Services",800,17939,7872,10072,"B - $10K to $20K"]
["Gadget","2019-06-11","Tue","Serving Brevard Realty","Services",800,17944,7872,10072,"B - $10K to $20K"]
["Widget","2018-05-29","Tue","Orange County Health Department","Associations",900,17959,7623,10341,"B - $10K to $20K"]
["Widget","2018-05-29","Tue","Orange County Health Department","Associations",900,17964,7623,10341,"B - $10K to $20K"]
["Gizmo","2018-09-01","Sat","Orange County Health Department","Associations",800,18067,8176,9896,"B - $10K to $20K"]
["Widget","2019-06-08","Sat","Safety Elements Ltd.","Services",900,18067,7623,10449,"B - $10K to $20K"]
["Gizmo","2018-09-01","Sat","Orange County Health Department","Associations",800,18072,8176,9896,"B - $10K to $20K"]
["Widget","2019-06-08","Sat","Safety Elements Ltd.","Services",900,18072,7623,10449,"B - $10K to $20K"]
["Gadget","2019-07-03","Wed","Orange County Health Department","Associations",900,18094,8856,9243,"B - $10K to $20K"]
["Gadget","2019-07-03","Wed","Orange County Health Department","Associations",900,18099,8856,9243,{"$f":"VLOOKUP(G899,$M$2:$N$6,2,TRUE)","v":"B - $10K to $20K"}]
["Gizmo","2018-10-08","Mon","Profology.com","Consulting",800,18203,8176,10032,"B - $10K to $20K"]
["Gizmo","2018-10-08","Mon","Profology.com","Consulting",800,18208,8176,10032,"B - $10K to $20K"]
["Widget","2018-12-05","Wed","Profology.com","Consulting",900,18238,7623,10620,"B - $10K to $20K"]
["Widget","2018-12-05","Wed","Profology.com","Consulting",900,18243,7623,10620,"B - $10K to $20K"]
["Gizmo","2018-04-29","Sun","Profology.com","Consulting",800,18259,8176,10088,"B - $10K to $20K"]
["Gizmo","2018-04-29","Sun","Profology.com","Consulting",800,18264,8176,10088,"B - $10K to $20K"]
["Widget","2019-05-06","Mon","Ribbon Commander Framework","Utilities",1000,18285,8470,9820,"B - $10K to $20K"]
["Widget","2019-07-30","Tue","Reports Wand","Applications",1000,18285,8470,9820,"B - $10K to $20K"]
["Widget","2019-05-06","Mon","Ribbon Commander Framework","Utilities",1000,18290,8470,9820,"B - $10K to $20K"]
["Widget","2019-07-30","Tue","Reports Wand","Applications",1000,18290,8470,9820,"B - $10K to $20K"]
["Gizmo","2019-12-22","Sun","Profology.com","Consulting",800,18299,8176,10128,"B - $10K to $20K"]
["Gizmo","2019-12-22","Sun","Profology.com","Consulting",800,18304,8176,10128,"B - $10K to $20K"]
["Gizmo","2019-04-10","Wed","Ribbon Commander Framework","Utilities",800,18339,8176,10168,"B - $10K to $20K"]
["Gizmo","2019-04-10","Wed","Ribbon Commander Framework","Utilities",800,18344,8176,10168,"B - $10K to $20K"]
["Gadget","2019-09-03","Tue","Ribbon Commander Framework","Utilities",900,18481,8856,9630,"B - $10K to $20K"]
["Gadget","2019-09-03","Tue","Ribbon Commander Framework","Utilities",900,18486,8856,9630,"B - $10K to $20K"]
["Widget","2019-07-31","Wed","Profology.com","Consulting",1000,18495,8470,10030,"B - $10K to $20K"]
["Gadget","2019-02-20","Wed","St. Peter's Prep","Training",800,18499,7872,10632,"B - $10K to $20K"]
["Widget","2019-07-31","Wed","Profology.com","Consulting",1000,18500,8470,10030,"B - $10K to $20K"]
["Gadget","2019-02-20","Wed","St. Peter's Prep","Training",800,18504,7872,10632,"B - $10K to $20K"]
["Widget","2019-09-27","Fri","SlinkyRN Excel Instruction and Consulting","Consulting",1000,18525,8470,10060,"B - $10K to $20K"]
["Widget","2019-09-27","Fri","SlinkyRN Excel Instruction and Consulting","Consulting",1000,18530,8470,10060,"B - $10K to $20K"]
["Gadget","2018-01-04","Thu","Reports Wand","Applications",800,18547,7872,10680,"B - $10K to $20K"]
["Gadget","2018-01-04","Thu","Reports Wand","Applications",800,18552,7872,10680,"B - $10K to $20K"]
["Gizmo","2019-12-20","Fri","St. Peter's Prep","Training",800,18555,8176,10384,"B - $10K to $20K"]
["Gizmo","2019-12-20","Fri","St. Peter's Prep","Training",800,18560,8176,10384,"B - $10K to $20K"]
["Widget","2019-10-22","Tue","Reports Wand","Applications",900,18571,7623,10953,"B - $10K to $20K"]
["Widget","2019-10-22","Tue","Reports Wand","Applications",900,18576,7623,10953,"B - $10K to $20K"]
["Widget","2018-07-22","Sun","Safety Elements Ltd.","Services",1000,18655,8470,10190,"B - $10K to $20K"]
["Widget","2018-07-22","Sun","Safety Elements Ltd.","Services",1000,18660,8470,10190,"B - $10K to $20K"]
["Gizmo","2018-12-24","Mon","Roto-Rooter","Services",900,18661,9198,9468,"B - $10K to $20K"]
["Gizmo","2018-12-24","Mon","Roto-Rooter","Services",900,18666,9198,9468,"B - $10K to $20K"]
["Gizmo","2018-08-20","Mon","Tennessee Moon","Retail",900,18679,9198,9486,"B - $10K to $20K"]
["Gizmo","2018-08-20","Mon","Tennessee Moon","Retail",900,18684,9198,9486,"B - $10K to $20K"]
["Gizmo","2019-12-09","Mon","Ribbon Commander Framework","Utilities",900,18751,9198,9558,"B - $10K to $20K"]
["Gizmo","2019-12-09","Mon","Ribbon Commander Framework","Utilities",900,18756,9198,9558,"B - $10K to $20K"]
["Gizmo","2018-03-17","Sat","Roto-Rooter","Services",900,18778,9198,9585,"B - $10K to $20K"]
["Gizmo","2018-03-17","Sat","Roto-Rooter","Services",900,18783,9198,9585,"B - $10K to $20K"]
["Gadget","2018-08-30","Thu","Resource Optimizer","Utilities",800,18899,7872,11032,"B - $10K to $20K"]
["Gadget","2018-08-30","Thu","Resource Optimizer","Utilities",800,18904,7872,11032,"B - $10K to $20K"]
["Gizmo","2018-05-31","Thu","St. Peter's Prep","Training",900,18913,9198,9720,"B - $10K to $20K"]
["Gizmo","2018-05-31","Thu","St. Peter's Prep","Training",900,18918,9198,9720,"B - $10K to $20K"]
["Widget","2019-08-27","Tue","Phare View Concepts","Consulting",900,18976,7623,11358,"B - $10K to $20K"]
["Widget","2019-08-27","Tue","Phare View Concepts","Consulting",900,18981,7623,11358,"B - $10K to $20K"]
["Gadget","2019-04-29","Mon","Profology.com","Consulting",900,18985,8856,10134,"B - $10K to $20K"]
["Gadget","2019-04-29","Mon","Profology.com","Consulting",900,18990,8856,10134,"B - $10K to $20K"]
["Gizmo","2018-07-04","Wed","Reports Wand","Applications",900,19057,9198,9864,"B - $10K to $20K"]
["Gizmo","2018-07-04","Wed","Reports Wand","Applications",900,19062,9198,9864,"B - $10K to $20K"]
["Widget","2019-01-14","Mon","Resource Optimizer","Utilities",1000,19105,8470,10640,"B - $10K to $20K"]
["Widget","2019-01-14","Mon","Resource Optimizer","Utilities",1000,19110,8470,10640,"B - $10K to $20K"]
["Gizmo","2019-05-31","Fri","Profology.com","Consulting",800,19147,8176,10976,"B - $10K to $20K"]
["Gizmo","2019-05-31","Fri","Profology.com","Consulting",800,19152,8176,10976,"B - $10K to $20K"]
["Gizmo","2019-10-18","Fri","Profology.com","Consulting",900,19156,9198,9963,"B - $10K to $20K"]
["Gizmo","2019-10-18","Fri","Profology.com","Consulting",900,19161,9198,9963,"B - $10K to $20K"]
["Widget","2019-01-31","Thu","Reports Wand","Applications",1000,19245,8470,10780,"B - $10K to $20K"]
["Widget","2019-01-31","Thu","Reports Wand","Applications",1000,19250,8470,10780,"B - $10K to $20K"]
["Gadget","2019-11-30","Sat","Profology.com","Consulting",800,19275,7872,11408,"B - $10K to $20K"]
["Gadget","2019-11-30","Sat","Profology.com","Consulting",800,19280,7872,11408,"B - $10K to $20K"]
["Gizmo","2018-05-03","Thu","Serving Brevard Realty","Services",800,19283,8176,11112,"B - $10K to $20K"]
["Gizmo","2018-05-03","Thu","Serving Brevard Realty","Services",800,19288,8176,11112,"B - $10K to $20K"]
["Gadget","2018-12-02","Sun","Orange County Health Department","Associations",800,19339,7872,11472,"B - $10K to $20K"]
["Gadget","2018-12-02","Sun","Orange County Health Department","Associations",800,19344,7872,11472,"B - $10K to $20K"]
["Gizmo","2018-08-26","Sun","Steve Comer","Services",900,19363,9198,10170,"B - $10K to $20K"]
["Gizmo","2018-08-26","Sun","Steve Comer","Services",900,19368,9198,10170,{"$f":"VLOOKUP(G963,$M$2:$N$6,2,TRUE)","v":"B - $10K to $20K"}]
["Gizmo","2018-11-13","Tue","Ribbon Commander Framework","Utilities",800,19371,8176,11200,"B - $10K to $20K"]
["Gizmo","2018-11-13","Tue","Ribbon Commander Framework","Utilities",800,19376,8176,11200,"B - $10K to $20K"]
["Gadget","2019-11-13","Wed","Orange County Health Department","Associations",800,19419,7872,11552,"B - $10K to $20K"]
["Gadget","2019-11-13","Wed","Orange County Health Department","Associations",800,19424,7872,11552,"B - $10K to $20K"]
["Gadget","2018-03-10","Sat","Reports Wand","Applications",900,19498,8856,10647,"B - $10K to $20K"]
["Gadget","2018-03-10","Sat","Reports Wand","Applications",900,19503,8856,10647,"B - $10K to $20K"]
["Gadget","2018-05-01","Tue","SkyWire, Inc.","Utilities",800,19515,7872,11648,"B - $10K to $20K"]
["Gadget","2018-05-01","Tue","SkyWire, Inc.","Utilities",800,19520,7872,11648,"B - $10K to $20K"]
["Widget","2019-08-06","Tue","Tennessee Moon","Retail",1000,19525,8470,11060,"B - $10K to $20K"]
["Widget","2019-08-06","Tue","Tennessee Moon","Retail",1000,19530,8470,11060,"B - $10K to $20K"]
["Gizmo","2018-04-11","Wed","Steve Comer","Services",900,19534,9198,10341,"B - $10K to $20K"]
["Gizmo","2018-04-11","Wed","Steve Comer","Services",900,19539,9198,10341,"B - $10K to $20K"]
["Gizmo","2019-12-05","Thu","Steve Comer","Services",800,19539,8176,11368,"B - $10K to $20K"]
["Gizmo","2019-12-05","Thu","Steve Comer","Services",800,19544,8176,11368,"B - $10K to $20K"]
["Gizmo","2018-08-06","Mon","St. Peter's Prep","Training",900,19579,9198,10386,"B - $10K to $20K"]
["Gizmo","2018-08-06","Mon","St. Peter's Prep","Training",900,19584,9198,10386,"B - $10K to $20K"]
["Gizmo","2019-08-26","Mon","Reports Wand","Applications",900,19588,9198,10395,"B - $10K to $20K"]
["Gizmo","2019-08-26","Mon","Reports Wand","Applications",900,19593,9198,10395,"B - $10K to $20K"]
["Widget","2018-06-13","Wed","Roto-Rooter","Services",1000,19625,8470,11160,"B - $10K to $20K"]
["Widget","2018-06-13","Wed","Roto-Rooter","Services",1000,19630,8470,11160,"B - $10K to $20K"]
["Gadget","2019-11-15","Fri","SkyWire, Inc.","Utilities",900,19669,8856,10818,"B - $10K to $20K"]
["Gadget","2019-11-15","Fri","SkyWire, Inc.","Utilities",900,19674,8856,10818,"B - $10K to $20K"]
["Widget","2018-02-07","Wed","SpringBoard","Utilities",1000,19885,8470,11420,"B - $10K to $20K"]
["Widget","2018-02-07","Wed","SpringBoard","Utilities",1000,19890,8470,11420,"B - $10K to $20K"]
["Gadget","2018-08-22","Wed","Resource Optimizer","Utilities",900,19984,8856,11133,"B - $10K to $20K"]
["Gadget","2018-08-22","Wed","Resource Optimizer","Utilities",900,19989,8856,11133,"B - $10K to $20K"]
["Gizmo","2018-09-13","Thu","St. Peter's Prep","Training",800,20003,8176,11832,"C - $20K to $30K"]
["Gizmo","2018-09-13","Thu","St. Peter's Prep","Training",800,20008,8176,11832,"C - $20K to $30K"]
["Gadget","2019-06-24","Mon","Resource Optimizer","Utilities",1000,20015,9840,10180,"C - $20K to $30K"]
["Gadget","2019-06-24","Mon","Resource Optimizer","Utilities",1000,20020,9840,10180,"C - $20K to $30K"]
["Gadget","2018-03-25","Sun","St. Peter's Prep","Training",1000,20085,9840,10250,"C - $20K to $30K"]
["Gadget","2018-03-25","Sun","St. Peter's Prep","Training",1000,20090,9840,10250,"C - $20K to $30K"]
["Gadget","2018-10-12","Fri","Resource Optimizer","Utilities",1000,20185,9840,10350,"C - $20K to $30K"]
["Gadget","2018-10-12","Fri","Resource Optimizer","Utilities",1000,20190,9840,10350,"C - $20K to $30K"]
["Widget","2018-02-18","Sun","Safety Elements Ltd.","Services",1000,20245,8470,11780,"C - $20K to $30K"]
["Widget","2018-02-18","Sun","Safety Elements Ltd.","Services",1000,20250,8470,11780,"C - $20K to $30K"]
["Widget","2019-05-01","Wed","Phare View Concepts","Consulting",1000,20305,8470,11840,"C - $20K to $30K"]
["Widget","2019-05-01","Wed","Phare View Concepts","Consulting",1000,20310,8470,11840,"C - $20K to $30K"]
["Gadget","2019-04-13","Sat","Surten Excel","Consulting",900,20398,8856,11547,"C - $20K to $30K"]
["Gadget","2019-04-13","Sat","Surten Excel","Consulting",900,20403,8856,11547,"C - $20K to $30K"]
["Gizmo","2018-04-04","Wed","St. Peter's Prep","Training",800,20403,8176,12232,"C - $20K to $30K"]
["Gizmo","2018-04-04","Wed","St. Peter's Prep","Training",800,20408,8176,12232,"C - $20K to $30K"]
["Gadget","2018-06-03","Sun","St. Peter's Prep","Training",1000,20475,9840,10640,"C - $20K to $30K"]
["Gadget","2018-06-03","Sun","St. Peter's Prep","Training",1000,20480,9840,10640,"C - $20K to $30K"]
["Gizmo","2019-02-28","Thu","St. Peter's Prep","Training",1000,20485,10220,10270,"C - $20K to $30K"]
["Gizmo","2019-02-28","Thu","St. Peter's Prep","Training",1000,20490,10220,10270,"C - $20K to $30K"]
["Gadget","2018-10-30","Tue","Steve Comer","Services",1000,20535,9840,10700,"C - $20K to $30K"]
["Gadget","2018-10-30","Tue","Steve Comer","Services",1000,20540,9840,10700,"C - $20K to $30K"]
["Gadget","2018-02-26","Mon","St. Peter's Prep","Training",900,20605,8856,11754,"C - $20K to $30K"]
["Gadget","2018-02-26","Mon","St. Peter's Prep","Training",900,20610,8856,11754,"C - $20K to $30K"]
["Gizmo","2018-12-15","Sat","SkyWire, Inc.","Utilities",900,20659,9198,11466,"C - $20K to $30K"]
["Gizmo","2018-12-15","Sat","SkyWire, Inc.","Utilities",900,20664,9198,11466,"C - $20K to $30K"]
["Gizmo","2019-04-21","Sun","SlinkyRN Excel Instruction and Consulting","Consulting",1000,20665,10220,10450,"C - $20K to $30K"]
["Gizmo","2019-04-21","Sun","SlinkyRN Excel Instruction and Consulting","Consulting",1000,20670,10220,10450,"C - $20K to $30K"]
["Widget","2018-01-25","Thu","Surten Excel","Consulting",1000,20765,8470,12300,"C - $20K to $30K"]
["Widget","2018-01-25","Thu","Surten Excel","Consulting",1000,20770,8470,12300,"C - $20K to $30K"]
["Gadget","2019-12-02","Mon","Safety Elements Ltd.","Services",1000,20835,9840,11000,"C - $20K to $30K"]
["Gadget","2019-12-02","Mon","Safety Elements Ltd.","Services",1000,20840,9840,11000,"C - $20K to $30K"]
["Gizmo","2019-02-24","Sun","SpringBoard","Utilities",1000,20935,10220,10720,"C - $20K to $30K"]
["Gizmo","2019-02-24","Sun","SpringBoard","Utilities",1000,20940,10220,10720,"C - $20K to $30K"]
["Gadget","2019-04-25","Thu","SpringBoard","Utilities",1000,20945,9840,11110,"C - $20K to $30K"]
["Gadget","2019-04-25","Thu","SpringBoard","Utilities",1000,20950,9840,11110,"C - $20K to $30K"]
["Widget","2019-10-20","Sun","Roto-Rooter","Services",1000,21005,8470,12540,"C - $20K to $30K"]
["Widget","2019-10-20","Sun","Roto-Rooter","Services",1000,21010,8470,12540,{"$f":"VLOOKUP(G1027,$M$2:$N$6,2,TRUE)","v":"C - $20K to $30K"}]
["Gizmo","2019-01-09","Wed","Ribbon Commander Framework","Utilities",900,21010,9198,11817,"C - $20K to $30K"]
["Gizmo","2019-01-09","Wed","Ribbon Commander Framework","Utilities",900,21015,9198,11817,"C - $20K to $30K"]
["Gadget","2018-11-15","Thu","Orange County Health Department","Associations",900,21028,8856,12177,"C - $20K to $30K"]
["Gadget","2018-11-15","Thu","Orange County Health Department","Associations",900,21033,8856,12177,"C - $20K to $30K"]
["Gizmo","2019-10-16","Wed","Resource Optimizer","Utilities",900,21037,9198,11844,"C - $20K to $30K"]
["Gizmo","2019-10-16","Wed","Resource Optimizer","Utilities",900,21042,9198,11844,"C - $20K to $30K"]
["Widget","2018-08-19","Sun","Safety Elements Ltd.","Services",1000,21115,8470,12650,"C - $20K to $30K"]
["Widget","2018-08-19","Sun","Safety Elements Ltd.","Services",1000,21120,8470,12650,"C - $20K to $30K"]
["Gizmo","2019-08-03","Sat","Steve Comer","Services",900,21154,9198,11961,"C - $20K to $30K"]
["Gizmo","2019-08-03","Sat","Steve Comer","Services",900,21159,9198,11961,"C - $20K to $30K"]
["Gadget","2018-07-08","Sun","Steve Comer","Services",900,21163,8856,12312,"C - $20K to $30K"]
["Gadget","2018-07-08","Sun","Steve Comer","Services",900,21168,8856,12312,"C - $20K to $30K"]
["Gadget","2018-03-28","Wed","SpringBoard","Utilities",900,21352,8856,12501,"C - $20K to $30K"]
["Gadget","2018-03-28","Wed","SpringBoard","Utilities",900,21357,8856,12501,"C - $20K to $30K"]
["Gizmo","2019-07-14","Sun","Serving Brevard Realty","Services",900,21361,9198,12168,"C - $20K to $30K"]
["Gizmo","2019-07-14","Sun","Serving Brevard Realty","Services",900,21366,9198,12168,"C - $20K to $30K"]
["Gizmo","2018-01-10","Wed","Roto-Rooter","Services",900,21433,9198,12240,"C - $20K to $30K"]
["Gizmo","2018-01-10","Wed","Roto-Rooter","Services",900,21438,9198,12240,"C - $20K to $30K"]
["Gizmo","2018-02-28","Wed","Surten Excel","Consulting",900,21451,9198,12258,"C - $20K to $30K"]
["Gizmo","2018-02-28","Wed","Surten Excel","Consulting",900,21456,9198,12258,"C - $20K to $30K"]
["Gizmo","2019-01-10","Thu","Phare View Concepts","Consulting",900,21460,9198,12267,"C - $20K to $30K"]
["Gizmo","2019-01-10","Thu","Phare View Concepts","Consulting",900,21465,9198,12267,"C - $20K to $30K"]
["Gadget","2018-12-04","Tue","Profology.com","Consulting",900,21541,8856,12690,"C - $20K to $30K"]
["Gadget","2018-12-04","Tue","Profology.com","Consulting",900,21546,8856,12690,"C - $20K to $30K"]
["Gadget","2018-07-14","Sat","SpringBoard","Utilities",900,21550,8856,12699,"C - $20K to $30K"]
["Gadget","2018-07-14","Sat","SpringBoard","Utilities",900,21555,8856,12699,"C - $20K to $30K"]
["Gadget","2018-02-06","Tue","Reports Wand","Applications",900,21703,8856,12852,"C - $20K to $30K"]
["Gadget","2018-02-06","Tue","Reports Wand","Applications",900,21708,8856,12852,"C - $20K to $30K"]
["Gadget","2018-01-07","Sun","Resource Optimizer","Utilities",1000,21725,9840,11890,"C - $20K to $30K"]
["Gadget","2018-01-07","Sun","Resource Optimizer","Utilities",1000,21730,9840,11890,"C - $20K to $30K"]
["Gadget","2019-11-14","Thu","SkyWire, Inc.","Utilities",1000,21735,9840,11900,"C - $20K to $30K"]
["Gadget","2019-11-14","Thu","SkyWire, Inc.","Utilities",1000,21740,9840,11900,"C - $20K to $30K"]
["Gizmo","2018-10-25","Thu","Ribbon Commander Framework","Utilities",900,21757,9198,12564,"C - $20K to $30K"]
["Gizmo","2018-10-25","Thu","Ribbon Commander Framework","Utilities",900,21762,9198,12564,"C - $20K to $30K"]
["Gadget","2018-07-31","Tue","Surten Excel","Consulting",1000,21795,9840,11960,"C - $20K to $30K"]
["Gadget","2018-07-31","Tue","Surten Excel","Consulting",1000,21800,9840,11960,"C - $20K to $30K"]
["Gizmo","2018-10-20","Sat","St. Peter's Prep","Training",900,21829,9198,12636,"C - $20K to $30K"]
["Gizmo","2018-10-20","Sat","St. Peter's Prep","Training",900,21834,9198,12636,"C - $20K to $30K"]
["Gizmo","2018-04-20","Fri","Ribbon Commander Framework","Utilities",1000,21875,10220,11660,"C - $20K to $30K"]
["Gizmo","2018-04-20","Fri","Ribbon Commander Framework","Utilities",1000,21880,10220,11660,"C - $20K to $30K"]
["Gizmo","2019-01-16","Wed","Serving Brevard Realty","Services",900,21883,9198,12690,"C - $20K to $30K"]
["Gizmo","2019-01-16","Wed","Serving Brevard Realty","Services",900,21888,9198,12690,"C - $20K to $30K"]
["Gizmo","2018-07-02","Mon","St. Peter's Prep","Training",900,21955,9198,12762,"C - $20K to $30K"]
["Gizmo","2018-07-02","Mon","St. Peter's Prep","Training",900,21960,9198,12762,"C - $20K to $30K"]
["Gizmo","2019-09-26","Thu","Reports Wand","Applications",900,22009,9198,12816,"C - $20K to $30K"]
["Gizmo","2019-09-26","Thu","Reports Wand","Applications",900,22014,9198,12816,"C - $20K to $30K"]
["Gizmo","2019-06-04","Tue","Roto-Rooter","Services",1000,22015,10220,11800,"C - $20K to $30K"]
["Gizmo","2019-06-04","Tue","Roto-Rooter","Services",1000,22020,10220,11800,"C - $20K to $30K"]
["Gadget","2018-06-19","Tue","Tennessee Moon","Retail",1000,22135,9840,12300,"C - $20K to $30K"]
["Gadget","2018-06-19","Tue","Tennessee Moon","Retail",1000,22140,9840,12300,"C - $20K to $30K"]
["Gizmo","2018-04-27","Fri","Resource Optimizer","Utilities",1000,22525,10220,12310,"C - $20K to $30K"]
["Gizmo","2018-04-27","Fri","Resource Optimizer","Utilities",1000,22530,10220,12310,"C - $20K to $30K"]
["Gizmo","2019-02-26","Tue","SkyWire, Inc.","Utilities",1000,22675,10220,12460,"C - $20K to $30K"]
["Gizmo","2019-02-26","Tue","SkyWire, Inc.","Utilities",1000,22680,10220,12460,"C - $20K to $30K"]
["Gizmo","2018-07-03","Tue","Phare View Concepts","Consulting",900,22711,9198,13518,"C - $20K to $30K"]
["Gizmo","2018-07-03","Tue","Phare View Concepts","Consulting",900,22716,9198,13518,"C - $20K to $30K"]
["Gizmo","2018-01-01","Mon","Orange County Health Department","Associations",1000,22805,10220,12590,"C - $20K to $30K"]
["Gizmo","2018-01-01","Mon","Orange County Health Department","Associations",1000,22810,10220,12590,"C - $20K to $30K"]
["Gizmo","2019-07-21","Sun","Roto-Rooter","Services",1000,22835,10220,12620,"C - $20K to $30K"]
["Gizmo","2019-07-21","Sun","Roto-Rooter","Services",1000,22840,10220,12620,"C - $20K to $30K"]
["Gizmo","2019-12-01","Sun","Orange County Health Department","Associations",900,22882,9198,13689,"C - $20K to $30K"]
["Gizmo","2019-12-01","Sun","Orange County Health Department","Associations",900,22887,9198,13689,"C - $20K to $30K"]
["Gadget","2018-10-23","Tue","Resource Optimizer","Utilities",1000,23035,9840,13200,"C - $20K to $30K"]
["Gadget","2018-10-23","Tue","Resource Optimizer","Utilities",1000,23040,9840,13200,{"$f":"VLOOKUP(G1091,$M$2:$N$6,2,TRUE)","v":"C - $20K to $30K"}]
["Gadget","2018-09-27","Thu","Steve Comer","Services",1000,23075,9840,13240,"C - $20K to $30K"]
["Gadget","2018-09-27","Thu","Steve Comer","Services",1000,23080,9840,13240,"C - $20K to $30K"]
["Gizmo","2018-03-26","Mon","SlinkyRN Excel Instruction and Consulting","Consulting",1000,23085,10220,12870,"C - $20K to $30K"]
["Gizmo","2018-03-26","Mon","SlinkyRN Excel Instruction and Consulting","Consulting",1000,23090,10220,12870,"C - $20K to $30K"]
["Gadget","2019-12-07","Sat","Profology.com","Consulting",1000,23685,9840,13850,"C - $20K to $30K"]
["Gadget","2019-12-07","Sat","Profology.com","Consulting",1000,23690,9840,13850,"C - $20K to $30K"]
["Gizmo","2018-02-20","Tue","Serving Brevard Realty","Services",1000,23805,10220,13590,"C - $20K to $30K"]
["Gizmo","2018-02-20","Tue","Serving Brevard Realty","Services",1000,23810,10220,13590,"C - $20K to $30K"]
["Gadget","2019-03-24","Sun","St. Peter's Prep","Training",1000,23815,9840,13980,"C - $20K to $30K"]
["Gadget","2019-03-24","Sun","St. Peter's Prep","Training",1000,23820,9840,13980,"C - $20K to $30K"]
["Gizmo","2018-07-27","Fri","Serving Brevard Realty","Services",1000,23885,10220,13670,"C - $20K to $30K"]
["Gizmo","2018-07-27","Fri","Serving Brevard Realty","Services",1000,23890,10220,13670,"C - $20K to $30K"]
["Gadget","2019-10-09","Wed","Ribbon Commander Framework","Utilities",1000,23965,9840,14130,"C - $20K to $30K"]
["Gadget","2019-10-09","Wed","Ribbon Commander Framework","Utilities",1000,23970,9840,14130,"C - $20K to $30K"]
["Gizmo","2019-06-03","Mon","Roto-Rooter","Services",1000,23985,10220,13770,"C - $20K to $30K"]
["Gizmo","2019-06-03","Mon","Roto-Rooter","Services",1000,23990,10220,13770,"C - $20K to $30K"]
["Gizmo","2019-10-05","Sat","Surten Excel","Consulting",1000,24065,10220,13850,"C - $20K to $30K"]
["Gizmo","2019-10-05","Sat","Surten Excel","Consulting",1000,24070,10220,13850,"C - $20K to $30K"]
["Gizmo","2018-07-10","Tue","Reports Wand","Applications",1000,24125,10220,13910,"C - $20K to $30K"]
["Gizmo","2018-07-10","Tue","Reports Wand","Applications",1000,24130,10220,13910,"C - $20K to $30K"]
["Doodads","2018-11-20","Tue","Steve Comer","Services",1000,24415,10220,14200,"C - $20K to $30K"]
["Doodads","2018-11-20","Tue","Steve Comer","Services",1000,24420,10220,14200,"C - $20K to $30K"]
["Gizmo","2018-03-14","Wed","Phare View Concepts","Consulting",1000,24425,10220,14210,"C - $20K to $30K"]
["Gizmo","2018-03-14","Wed","Phare View Concepts","Consulting",1000,24430,10220,14210,"C - $20K to $30K"]
["Gizmo","2019-12-15","Sun","St. Peter's Prep","Training",1000,25005,10220,14790,"C - $20K to $30K"]
["Gizmo","2019-12-15","Sun","St. Peter's Prep","Training",1000,25010,10220,14790,"C - $20K to $30K"]
["Gizmo","2018-04-28","Sat","Surten Excel","Consulting",1000,25055,10220,14840,"C - $20K to $30K"]
["Gizmo","2018-04-28","Sat","Surten Excel","Consulting",1000,25060,10220,14840,"C - $20K to $30K"]
["Gizmo","2019-02-19","Tue","Safety Elements Ltd.","Services",1000,25075,10220,14860,"C - $20K to $30K"]
["Gizmo","2019-02-19","Tue","Safety Elements Ltd.","Services",1000,25080,10220,14860,"C - $20K to $30K"]
["Gizmo","2018-02-26","Mon","SlinkyRN Excel Instruction and Consulting","Consulting",1000,25135,10220,14920,"C - $20K to $30K"]
["Gizmo","2018-02-26","Mon","SlinkyRN Excel Instruction and Consulting","Consulting",1000,25140,10220,14920,"C - $20K to $30K"]
["Gizmo","2019-05-02","Thu","Orange County Health Department","Associations",1000,25305,10220,15090,"C - $20K to $30K"]
["Gizmo","2019-05-02","Thu","Orange County Health Department","Associations",1000,25310,10220,15090,"C - $20K to $30K"]
["Gizmo","2018-07-17","Tue","SlinkyRN Excel Instruction and Consulting","Consulting",1000,25345,10220,15130,"C - $20K to $30K"]
["Gizmo","2018-07-17","Tue","SlinkyRN Excel Instruction and Consulting","Consulting",1000,25350,10220,15130,"C - $20K to $30K"]
["Gizmo","2018-07-15",null,"Roto-Rooter",{"$f":"VLOOKUP(D1128,$D$2:$E$564,2,0)","v":"Services"},{"$f":"ROUND(G1128/15,-1)","v":103000},1544994,{"$f":"+G1128-I1128","v":463494},1081500,"E - Over $1MM"]
["Widget","2019-03-15",null,"Surten Excel","Consulting",102680,1540227,492827,1047400,"E - Over $1MM"]
["Gizmo","2019-04-15",null,"Tennessee Moon","Retail",101370,1520493,471393,1049100,"E - Over $1MM"]
["Gadget","2018-08-15",null,"Safety Elements Ltd.","Services",99440,1491609,372909,1118700,"E - Over $1MM"]
["Widget","2018-09-15",null,"Serving Brevard Realty","Services",94260,1413882,494882,919000,"E - Over $1MM"]
["Widget","2019-06-15",null,"Phare View Concepts","Consulting",91760,1376399,481699,894700,"E - Over $1MM"]
["Gadget","2019-02-15",null,"Steve Comer","Services",67040,1005663,331863,673800,"E - Over $1MM"]
["Widget","2019-12-15",null,"Serving Brevard Realty","Services",68660,1029841,288341,741500,"E - Over $1MM"]
["Widget","2018-12-15",null,"SpringBoard","Utilities",71130,1066957,266757,800200,"E - Over $1MM"]
["Gadget","2019-08-15",null,"Reports Wand","Applications",78750,1181201,342501,838700,"E - Over $1MM"]
["Gizmo","2018-01-15",null,"Orange County Health Department","Associations",81500,1222542,330042,892500,"E - Over $1MM"]
["Gadget","2019-05-15",null,"Orange County Health Department","Associations",82200,1233010,357610,875400,"E - Over $1MM"]
["Widget","2019-09-15",null,"Resource Optimizer","Utilities",82800,1242019,360219,881800,"E - Over $1MM"]
["Widget","2018-03-15",null,"Profology.com","Consulting",85200,1278024,370624,907400,"E - Over $1MM"]
["Gizmo","2018-10-15",null,"SkyWire, Inc.","Utilities",86160,1292368,400668,891700,"E - Over $1MM"]
["Gizmo","2019-01-15",null,"St. Peter's Prep","Training",87350,1310229,340629,969600,"E - Over $1MM"]
["Gadget","2019-11-15",null,"Roto-Rooter","Services",89020,1335349,387249,948100,"E - Over $1MM"]
["Gadget","2018-05-15",null,"Resource Optimizer","Utilities",90170,1352548,473348,879200,"E - Over $1MM"]
["Gizmo","2019-07-15",null,"Profology.com","Consulting",91760,1376399,481699,894700,"E - Over $1MM"]
["Gadget","2018-02-15",null,"Phare View Concepts","Consulting",94260,1413882,494882,919000,"E - Over $1MM"]
["Gadget","2018-11-15",null,"SlinkyRN Excel Instruction and Consulting","Consulting",99440,1491609,372909,1118700,"E - Over $1MM"]
["Gizmo","2018-04-15",null,"Reports Wand","Applications",101370,1520493,471393,1049100,"E - Over $1MM"]
["Gizmo","2019-10-15",null,"Ribbon Commander Framework","Utilities",102680,1540227,492827,1047400,"E - Over $1MM"]
["Widget","2018-06-15",null,"Ribbon Commander Framework","Utilities",103000,1544994,463494,1081500,"E - Over $1MM"]

{"sheet":"Wrap Up","index":3,"n_rows":8,"n_cols":2,"rows_kept":8,"cut":false,"hidden":false,"merged":[]}
["Topics in this Episode"]
[]
[null,"Creating Stratifications with a Pivot Table"]
[null,"Yesterday, in episode 2101, used automatic grouping"]
[null,"That forces all buckets to be the same size - $10K in yesterday's example"]
[null,"To create buckets of varying sizes, there are two options:"]
[null,"Select a manual group and choose Group"]
[null,"Use a Lookup table to apply a category and add that to the pivot table"]